program: Gaussian 09
title: 000149291
version: EM64L-G09RevD.01
frameworkgroup: C1[X(C9H16ClN3O3)]
method: RPBEPBE
basis: SDD
operation: Freq
keyword: #p
keyword: freq=noraman
keyword: PBEPBE/SDD
title: #p freq=noraman PBEPBE/SDD
converged: YES YES NO NO
title: Mulliken charges:
elementType: Cl O O O N N N C C C C C C C C C H H H H H H H H H H H H H H H H
charge: -0.038045 -0.429654 -0.248259 -0.232932 -0.442248 -0.181653 0.035392 -0.113271 -0.089330 -0.407205 -0.458489 -0.419658 -0.388503 0.318845 -0.335944 -0.567821 0.280869 0.227936 0.208998 0.223107 0.191220 0.237925 0.219257 0.197370 0.213116 0.204071 0.347566 0.331231 0.277878 0.269425 0.280263 0.288544
chargesum: 0.00000
title: Mulliken charges with hydrogens summed into heavy atoms:
elementType: Cl O O O N N N C C C C C C C C C
charge: -0.038045 -0.098423 -0.248259 -0.232932 -0.094682 -0.181653 0.035392 0.167599 0.138606 0.024900 -0.029344 -0.003032 0.028684 0.318845 0.211360 0.000986
polarizability: 1.81155061e+02 2.17490852e+00 1.26437200e+02 -2.17562192e+00 -1.17141508e+01 1.10094392e+02
1716.lowfreq: -0.0019 -0.0018 -0.0013 2.4095 6.4297 12.5437 22.6131 26.9441 44.9538
frequency: 21.5589 26.3531 44.8961 61.1100 64.6867 77.8643 127.2008 140.0614 168.3435 205.7460 218.7682 243.6773 264.1018 302.9590 325.4616 329.7160 359.0183 383.4765 407.3081 413.1576 457.1831 483.0381 500.2280 569.6760 620.1329 691.0594 704.3841 712.7326 727.6615 770.3162 799.1317 809.8378 838.6750 841.5791 894.3843 906.9550 922.1980 959.7331 979.1540 1017.7492 1038.2721 1046.8376 1051.7572 1065.1300 1097.9193 1107.6352 1127.3606 1140.2258 1202.7534 1212.0660 1222.7654 1237.0251 1246.7426 1259.0529 1267.0077 1291.8149 1313.1805 1323.7496 1330.5610 1334.7905 1342.0075 1349.1408 1357.7650 1361.4238 1372.2215 1373.2805 1437.0214 1455.3027 1457.2344 1468.5989 1475.5424 1478.5162 1501.4850 1666.8088 2964.8132 2968.0905 2977.0442 2985.4086 3034.4212 3039.4842 3043.4912 3045.5709 3051.8362 3056.5453 3061.7041 3069.4740 3122.2888 3158.8851 3487.6877 3531.1955
redmass: 6.0959 5.5271 7.3584 4.2423 3.8865 4.3573 7.3562 4.3674 5.9122 2.4721 6.3541 8.2043 2.1145 1.9394 2.5228 2.7346 3.1288 2.4470 3.8894 5.3674 11.3469 3.0978 3.8709 2.3807 2.6566 6.3988 2.2119 2.4926 2.1523 1.7598 2.3037 1.6293 4.5258 2.6717 2.0640 1.7841 2.1632 2.7930 2.6880 2.7152 1.6388 1.9705 2.4894 1.6373 1.3832 2.5892 2.0730 2.3688 1.5612 1.8382 1.5424 1.3718 2.3732 1.3683 1.1718 1.4053 1.3303 1.1999 1.4628 1.3780 1.4444 1.3759 1.3312 1.6834 3.0913 1.2903 1.1096 1.0930 1.0867 1.1005 1.2901 1.1088 1.3626 9.8257 1.0675 1.0672 1.0611 1.0624 1.0860 1.0936 1.0995 1.0596 1.1001 1.0926 1.0913 1.0557 1.1044 1.1128 1.0762 1.0653
irintensity: 0.3925 0.2212 0.4737 1.6078 2.1985 1.0772 4.9046 9.2877 1.1178 6.0705 7.1581 10.4667 40.6357 4.6596 48.4424 12.5011 82.0539 5.5070 1.7277 5.6106 0.1669 2.4730 4.7844 7.0685 2.8767 29.5744 45.0621 88.7076 6.0353 20.6204 80.0924 5.0899 9.6936 11.4652 12.3820 58.4090 95.2275 4.4272 36.2711 63.7066 15.5814 34.8906 11.5359 4.8500 0.3301 9.6149 5.2158 31.5117 14.2925 7.0898 16.8130 4.4169 48.4442 12.3966 5.6697 7.0332 3.6103 6.1897 39.4556 3.1674 12.0541 4.6666 9.7804 87.8928 71.7738 28.7647 19.4408 9.3764 11.0728 3.8236 215.3678 34.2811 308.5617 250.0725 20.3762 21.9806 44.3897 23.9845 25.0022 41.1767 44.8186 1.8315 21.6872 38.9858 56.0350 12.9584 1.3164 2.4111 31.8213 5.1375
temp: 298.150 k
press: 1.00000 atm
elementType: 17 8 8 8 7 7 7 6 6 6 6 6 6 6 6 6 1 1 1 1 1 1 1 1 1 1 1 1 1 1 1 1
symmnumber: 1
zpe: 675903.3 jmol-1
zpe.correction: 0.257438 hartree
zpe.thermalcorrener: 0.274358 hartree
zpe.thermalcorrenthalpy: 0.275302 hartree
zpe.thermalcorrgfe: 0.210213 hartree
zpe.sumelectzpe: -1201.234712 hartree
zpe.sumelectthermal: -1201.217793 hartree
zpe.sumelectthermalent: -1201.216849 hartree
zpe.sumelectthermalfe: -1201.281937 hartree
dipole: 3.9357 1.7939 0.8059
dipole: 4.3997
quadrupole: -105.5463 -116.9132 -104.2803
quadrupole: 4.2269 5.0257 2.1398
quadrupole: 3.3670 -7.9999 4.6329 4.2269 5.0257 2.1398
hfenergy: -1201.4921504 hartree
pointgroup: C01 [X(C9H16Cl1N3O3)]
dipole: 1.5005592 0.4227875 0.7522064 debye
polarizability: 180.7961744|4.2695656|132.0585685|3.2602601|4.6635882|104.8319106 unknown
InChI: InChI=1S/C9H16ClN3O3/c10-5-6-13(12-16)9(15)11-7-3-1-2-4-8(7)14/h7-8,11,14H,1-6H2
charge 0 multiplicity 1
32 atoms
Cl -5.661939 -0.676706 -0.650592
O  1.930989 -0.530461 -2.404279
O  -1.028178 -1.928316 0.126676
O  -2.333892 2.455745 0.66484
N  0.537495 -0.167599 0.143561
N  -1.78114 0.280699 0.41293
N  -1.381927 1.617948 0.515798
C  1.755621 -1.007248 0.04331
C  2.649714 -0.505129 -1.124838
C  2.555649 -1.010115 1.373487
C  3.269855 0.878281 -0.827002
C  3.193083 0.367157 1.680004
C  4.06981 0.854079 0.500465
C  -0.720279 -0.710782 0.217534
C  -3.194008 -0.149028 0.514451
C  -3.869461 -0.144368 -0.867367
H  1.401281 -2.025831 -0.19181
H  3.461876 -1.242178 -1.262076
H  3.356766 -1.771315 1.286442
H  1.892916 -1.334054 2.197421
H  2.47118 1.649358 -0.772179
H  3.918299 1.162941 -1.675055
H  3.798283 0.297923 2.60325
H  2.400258 1.116355 1.886189
H  4.478788 1.859361 0.714119
H  4.93794 0.172902 0.387793
H  0.61383 0.840622 0.316418
H  1.086026 -0.021956 -2.290963
H  -3.203293 -1.165324 0.936294
H  -3.708911 0.554654 1.190456
H  -3.904404 0.859404 -1.31418
H  -3.415025 -0.876921 -1.549295
