program: Gaussian 09
title: 000149279
version: EM64L-G09RevD.01
frameworkgroup: C1[X(C12H22O)]
method: RPBEPBE
basis: SDD
operation: Freq
keyword: #pfreq=noraman
keyword: PBEPBE/SDD
title: #p freq=noraman PBEPBE/SDD
converged: YES YES NO NO
title: Mulliken charges:
elementType: O C C C C C C C C C C C C H H H H H H H H H H H H H H H H H H H H H H
charge: -0.231895 -0.381469 -0.371677 -0.369086 -0.353264 -0.379065 -0.356718 -0.531807 -0.696584 0.182864 -0.290152 -0.094959 -0.743231 0.194110 0.193942 0.188033 0.187915 0.186622 0.186551 0.188380 0.188309 0.217251 0.216050 0.194290 0.194374 0.232928 0.233221 0.209926 0.214544 0.209980 0.225397 0.256884 0.228957 0.234670 0.234712
chargesum: 0.00000
title: Mulliken charges with hydrogens summed into heavy atoms:
elementType: O C C C C C C C C C C C C
charge: -0.231895 0.006583 0.004270 0.004086 0.023424 0.054236 0.031946 -0.065659 -0.062134 0.182864 -0.064755 0.161924 -0.044892
polarizability: 1.99040200e+02 -1.40377727e+00 1.18537328e+02 7.65191326e-02 -3.29590434e-02 9.64538560e+01
1716.lowfreq: -3.8902 -0.0006 0.0012 0.0012 7.9152 19.6717 27.9062 35.3602 54.6177
frequency: 25.5600 35.3483 47.1157 58.9575 87.0065 95.0325 99.0028 123.6793 139.7946 153.3318 165.9629 181.1299 191.3029 200.4434 224.6494 251.4956 337.4504 360.9151 398.0830 454.6462 487.6327 532.3711 692.1448 718.2226 724.6994 741.2385 779.0630 815.2471 864.7376 879.5792 889.3870 931.0430 934.2392 989.7244 990.7357 1006.4975 1022.5954 1036.8721 1054.8164 1066.0850 1080.4480 1082.3374 1094.8509 1095.5230 1122.8548 1145.0188 1185.8019 1217.2743 1218.5650 1254.2164 1256.7854 1280.1525 1280.8900 1284.5104 1294.6936 1294.9144 1298.6521 1309.4636 1332.5322 1352.1273 1356.3970 1361.1540 1388.2594 1393.5534 1429.8278 1456.7204 1461.3507 1463.1395 1464.0667 1465.8694 1471.2157 1475.9438 1478.0993 1485.0318 1490.0886 1582.0131 1665.1634 2946.4461 2949.3380 2951.4316 2954.7996 2962.3680 2967.8484 2969.2179 2972.0250 2984.6154 2989.0715 2991.3627 2993.2277 3003.6089 3022.1566 3038.0023 3040.0372 3056.0836 3068.7126 3070.5153 3081.0118 3100.6489 3107.3683
redmass: 3.6780 3.8534 2.2185 2.5950 1.6212 3.6820 2.1587 1.6752 1.9408 1.9610 3.9854 4.2356 1.9856 1.6463 1.1352 3.7560 3.4405 4.0809 3.5387 2.9600 3.2097 2.1190 4.7846 1.0947 1.0754 1.1519 1.2474 1.3251 1.3539 2.5457 1.9378 2.7262 1.2942 1.0838 4.2301 1.1731 3.4564 2.7851 1.5874 2.7111 2.2821 2.1176 1.4980 1.6945 2.7349 2.4642 1.7850 1.3172 1.4401 1.3274 1.2720 1.0640 1.3416 1.0980 1.3106 1.1117 1.1046 1.5027 1.5847 1.6358 1.6762 1.7436 1.2172 1.2315 1.0996 1.0476 1.0732 1.0691 1.0799 1.0717 1.0765 1.0424 1.0774 1.0878 1.0950 8.0548 5.7410 1.0599 1.0589 1.0588 1.0590 1.0591 1.0372 1.0587 1.0366 1.0964 1.0963 1.0993 1.0603 1.1020 1.1042 1.1045 1.0956 1.1032 1.1007 1.0993 1.0959 1.0963 1.0885
irintensity: 0.0424 0.6886 1.7092 0.0340 0.0205 0.6221 0.6998 1.7428 0.2232 0.2407 2.3406 0.1824 0.0228 0.6201 0.0001 4.9088 3.2885 0.2536 4.5732 0.2259 3.3816 0.3615 4.7432 13.1686 5.8717 3.6827 0.0007 0.0104 3.6772 0.3729 10.8016 62.7635 0.1813 54.1828 0.3409 0.5660 2.3135 17.7205 0.3117 7.6246 0.1399 0.3494 0.8620 2.0150 7.6909 39.3025 0.0606 25.8412 0.1852 4.0059 0.0078 0.0925 25.6931 0.4460 19.9166 1.2209 0.0938 22.7868 32.1726 7.6144 4.2141 12.4814 11.2170 13.7634 20.7641 16.2770 0.7677 0.0896 50.4995 0.3406 1.6093 12.3185 3.8304 1.7282 27.9448 142.3059 115.9100 14.6692 15.3944 7.4110 0.1779 29.1088 19.1717 143.6931 36.3197 2.3523 10.8032 0.0539 31.9919 0.9764 0.1964 88.2011 16.7006 97.4730 101.6480 55.6469 9.3517 1.8751 33.3759
temp: 298.150 k
press: 1.00000 atm
elementType: 8 6 6 6 6 6 6 6 6 6 6 6 6 1 1 1 1 1 1 1 1 1 1 1 1 1 1 1 1 1 1 1 1 1 1
symmnumber: 1
zpe: 815717.1 jmol-1
zpe.correction: 0.310690 hartree
zpe.thermalcorrener: 0.327755 hartree
zpe.thermalcorrenthalpy: 0.328700 hartree
zpe.thermalcorrgfe: 0.263906 hartree
zpe.sumelectzpe: -544.624004 hartree
zpe.sumelectthermal: -544.606939 hartree
zpe.sumelectthermalent: -544.605995 hartree
zpe.sumelectthermalfe: -544.670788 hartree
dipole: 1.3082 -2.9091 0.0144
dipole: 3.1897
quadrupole: -66.2763 -86.7626 -82.0879
quadrupole: -8.7848 0.0711 0.0000
quadrupole: 12.0993 -8.3870 -3.7123 -8.7848 0.0711 0.0000
hfenergy: -544.9346942 hartree
pointgroup: C01 [X(C12H22O1)]
dipole: -0.5080067 -1.1463328 -0.0517238 debye
polarizability: 199.0203054|1.8836903|118.5156902|-0.2174866|0.9483453|96.4953878 unknown
InChI: InChI=1S/C12H22O/c1-3-5-6-7-8-9-11-12(13)10-4-2/h4,10H,3,5-9,11H2,1-2H3
charge 0 multiplicity 1
35 atoms
O  -2.988853 1.560775 0.095312
C  2.160272 0.320385 0.007619
C  3.451591 -0.528109 -0.018298
C  0.868561 -0.527757 -0.010309
C  4.742522 0.321349 -0.00297
C  -0.41552 0.329903 0.020014
C  6.034832 -0.526789 -0.028617
C  -1.697706 -0.519237 -0.003679
C  7.318905 0.330779 -0.012675
C  -2.994453 0.294269 0.035527
C  -4.262503 -0.495307 0.000158
C  -5.488232 0.102051 0.030854
C  -6.813104 -0.609793 -0.001041
H  2.162244 0.964047 0.911946
H  2.156834 1.009689 -0.862412
H  3.455959 -1.216042 0.853347
H  3.44867 -1.1730 -0.922305
H  0.874634 -1.219102 0.859015
H  0.866682 -1.169428 -0.916966
H  4.746997 0.966649 0.90049
H  4.740023 1.009075 -0.874565
H  -0.421417 0.971225 0.92231
H  -0.425663 1.026705 -0.840218
H  6.02921 -1.170701 -0.931944
H  6.036248 -1.213994 0.842198
H  -1.724694 -1.163359 -0.909414
H  -1.713727 -1.227726 0.853092
H  7.353928 1.006695 -0.888031
H  8.228363 -0.297708 -0.034152
H  7.363454 0.959477 0.896773
H  -4.17406 -1.589696 -0.052375
H  -5.501376 1.201882 0.083502
H  -6.697147 -1.705659 -0.056805
H  -7.415246 -0.276429 -0.869209
H  -7.409728 -0.366021 0.900129
