program: Gaussian 09
title: 000149375
version: EM64L-G09RevD.01
frameworkgroup: C1[X(C24H25N3O2S)]
method: RPBEPBE
basis: SDD
operation: Freq
keyword: #p
keyword: freq=noraman
keyword: PBEPBE/SDD
title: #p freq=noraman PBEPBE/SDD
converged: YES YES NO NO
title: Mulliken charges:
elementType: S O O N N N C C C C C C C C C C C C C C C C C C C C C C C C H H H H H H H H H H H H H H H H H H H H H H H H H
charge: 0.956860 -0.542547 -0.544290 -0.486041 -0.503147 -0.033255 -0.299853 -0.633900 -0.342408 -0.353440 0.228935 0.234449 0.237869 0.274603 0.447622 -0.110171 -0.094048 -0.691043 -0.282536 -0.372207 -0.449642 -0.320866 -0.336745 -0.386410 -0.307834 -0.306159 -0.263263 -0.258893 -0.237012 -0.233378 0.226245 0.239030 0.269907 0.270075 0.194854 0.192912 0.202942 0.203188 0.268840 0.309319 0.211493 0.210122 0.221679 0.287202 0.229090 0.235153 0.271910 0.268750 0.225682 0.267349 0.267971 0.234075 0.230956 0.234913 0.235093
chargesum: 0.00000
title: Mulliken charges with hydrogens summed into heavy atoms:
elementType: S O O N N N C C C C C C C C C C C C C C C C C C C C C C C C
charge: 0.956860 -0.542547 -0.544290 -0.217201 -0.193828 -0.033255 0.165422 -0.093918 0.045358 0.052689 0.228935 0.234449 0.237869 0.274603 0.447622 -0.110171 -0.094048 -0.047749 0.004666 -0.143117 -0.214490 -0.048955 -0.067995 -0.160728 -0.040485 -0.038187 -0.029188 -0.027936 -0.002100 0.001715
polarizability: 5.75273012e+02 4.56536418e+01 4.08841542e+02 -3.45948051e+01 4.03025007e+01 2.39023198e+02
1716.lowfreq: -7.9812 -6.5273 -0.0016 -0.0014 -0.0011 2.5683 3.9559 8.1857 21.0121
frequency: -4.1372 7.1917 20.9903 29.0363 39.2380 42.3419 47.4908 64.1246 75.0621 90.4095 96.7730 106.6947 117.0689 118.9948 131.2886 151.4180 173.3027 182.3128 190.2642 220.5331 227.2939 239.3325 245.0378 284.5903 294.7042 301.2966 316.1434 365.2200 372.8634 391.1344 395.3945 401.6607 407.2407 419.6652 434.7813 474.2951 477.3424 491.9973 504.6066 508.8071 528.6635 547.6908 563.5561 583.1176 589.9564 614.3953 631.1862 637.8383 654.3324 702.9256 724.1616 734.3827 747.1064 759.5875 761.0829 771.7518 778.8006 800.5312 804.7517 813.3421 821.3695 829.2693 830.2131 847.3114 856.1555 867.2852 872.1464 879.4517 891.6914 918.3138 928.0789 946.4962 957.9199 962.7597 965.0905 969.4647 995.2067 995.6394 996.3270 1002.7079 1018.9482 1021.9227 1048.3292 1062.3775 1068.7799 1081.3238 1106.2716 1110.2220 1116.8579 1150.6102 1161.4238 1180.7847 1183.4100 1189.6568 1195.3377 1212.3107 1223.5565 1241.6752 1249.9792 1253.0870 1270.5118 1274.8357 1283.8653 1286.8513 1289.3612 1292.9438 1316.8775 1330.5785 1346.5933 1349.9118 1368.5209 1375.3850 1390.3989 1396.1398 1411.8450 1426.9342 1434.4117 1441.6103 1454.4334 1467.5029 1471.0336 1473.9262 1476.8543 1480.6816 1485.1657 1489.1254 1497.0181 1524.9526 1549.6283 1550.9396 1573.0694 1610.9942 1613.2378 1630.8392 2962.5714 2974.4271 2976.0834 2999.1808 3005.5229 3032.2709 3033.0902 3063.5504 3072.2673 3075.6354 3118.1955 3124.1297 3124.3103 3125.1630 3134.4881 3139.3693 3149.2888 3156.6906 3165.3816 3167.0714 3172.1443 3174.9182 3179.6278 3350.4930 3519.1520
redmass: 4.4249 5.1889 5.5076 2.4635 3.3962 4.0983 4.5083 5.1484 4.6871 3.6524 3.0238 3.5313 2.2354 3.6385 6.9672 6.2021 4.8584 7.4885 5.7255 5.0919 1.1129 4.4534 4.6662 4.6071 4.9025 4.1176 5.9552 6.1523 5.1114 3.4582 6.3366 4.0092 3.3676 3.0035 4.5487 2.9167 5.0466 1.7236 3.1268 5.1943 2.5867 5.2391 5.2953 3.8844 6.2525 5.6371 5.7874 5.9696 5.7877 4.7452 3.8873 1.0706 3.4555 1.2614 1.6910 1.3700 2.6608 3.0038 2.0651 1.8307 1.2984 5.4656 1.8923 1.6216 5.4402 3.1890 1.6622 2.3007 1.8619 2.0389 6.1548 1.3507 1.4054 1.3602 1.7926 1.3553 1.3474 2.5797 1.3568 4.2965 2.2912 2.0303 2.9699 1.2562 2.5661 4.0394 2.2401 2.0095 1.4313 1.3415 1.1813 1.1916 1.1990 1.2782 1.4817 1.2115 1.4281 2.5951 2.9748 1.2911 2.1351 1.2852 1.9105 1.0455 3.3294 1.1366 1.6742 1.3377 1.5356 2.4137 2.2824 3.7529 1.2121 3.0725 1.1119 5.5475 3.8793 2.7362 3.0784 1.0682 1.0702 2.3120 1.0423 1.0688 2.7768 1.0917 3.0278 6.7222 7.0656 6.4990 3.7389 5.7404 6.2204 6.4003 1.0582 1.0360 1.0599 1.0601 1.0989 1.1032 1.0548 1.1037 1.1015 1.0992 1.0897 1.0866 1.0898 1.1105 1.0859 1.0890 1.0895 1.0949 1.0945 1.0949 1.0996 1.0997 1.0953 1.0753 1.0748
irintensity: 0.3077 0.9589 1.0834 1.8155 1.4318 0.3652 0.5142 1.6601 1.1384 9.6894 2.9543 1.8634 0.1070 1.3238 16.5275 48.5034 9.0380 38.7412 1.0600 5.2822 0.0084 1.1436 1.3847 15.7014 2.3461 2.1810 19.2887 19.1911 6.2756 26.4140 5.7063 20.3575 9.2632 3.2403 16.1226 36.2194 67.0320 212.6710 19.8728 10.4088 5.9785 7.7987 10.2440 7.2409 2.4828 23.2010 6.8397 9.8805 6.3695 15.2333 4.3751 9.0957 3.8946 17.4588 75.9025 10.7852 54.9806 19.2639 32.3581 53.2041 3.1262 13.4397 102.2844 132.2071 2.4108 5.0328 1.6242 0.8420 3.4548 26.9478 3.4108 0.5225 4.4432 0.9335 15.9295 3.3162 0.2741 0.4287 0.3871 10.8265 3.8198 11.3147 7.1474 8.4215 2.0853 9.4041 69.8843 0.6772 19.8847 13.7785 0.4213 25.6941 16.8442 2.3022 0.9145 0.9178 0.5498 2.1978 12.0144 0.1541 35.8701 13.0529 7.7783 0.6230 22.6639 0.6823 20.9901 16.0233 0.5529 56.3766 17.8934 179.6019 10.7264 17.5930 7.2718 165.9219 37.7868 16.4573 6.3580 3.0911 0.4947 15.4830 12.9556 3.4151 147.6421 20.0941 403.7461 38.9059 85.5311 8.1867 33.6277 9.6992 310.5891 9.9163 5.5907 43.8469 38.7225 24.2276 2.6422 18.1744 6.7116 1.6140 89.1683 49.4598 14.1670 4.3051 9.7877 3.9064 5.3155 13.5235 9.2266 19.8887 15.5374 7.0782 33.1123 23.4469 0.6972 16.1360 28.5591
temp: 298.150 k
press: 1.00000 atm
elementType: 16 8 8 7 7 7 6 6 6 6 6 6 6 6 6 6 6 6 6 6 6 6 6 6 6 6 6 6 6 6 1 1 1 1 1 1 1 1 1 1 1 1 1 1 1 1 1 1 1 1 1 1 1 1 1
symmnumber: 1
zpe: 1142726.0 jmol-1
zpe.correction: 0.435241 hartree
zpe.thermalcorrener: 0.463186 hartree
zpe.thermalcorrenthalpy: 0.464130 hartree
zpe.thermalcorrgfe: 0.373367 hartree
zpe.sumelectzpe: -1640.022052 hartree
zpe.sumelectthermal: -1639.994107 hartree
zpe.sumelectthermalent: -1639.993163 hartree
zpe.sumelectthermalfe: -1640.083926 hartree
dipole: 3.2624 4.3891 -1.6982
dipole: 5.7264
quadrupole: -222.4608 -179.0875 -179.4092
quadrupole: -29.5440 16.1909 12.0141
quadrupole: -28.8083 14.5650 14.2433 -29.5440 16.1909 12.0141
hfenergy: -1640.4572933 hartree
pointgroup: C01 [X(C24H25N3O2S1)]
dipole: 1.0661918 1.9249434 -0.4832151 debye
polarizability: 562.3492005|67.2570559|414.8640994|-28.8637858|52.4036641|245.9244518 unknown
InChI: InChI=1S/C24H25N3O2S/c1-2-3-8-17-30(28,29)27-19-15-13-18(14-16-19)25-24-20-9-4-6-11-22(20)26-23-12-7-5-10-21(23)24/h4-7,9-16,25,27H,2-3,8,17H2,1H3
charge 0 multiplicity 1
55 atoms
S  -4.845944 -2.356756 -0.083189
O  -5.942377 -3.306739 -0.820891
O  -4.931057 -2.047746 1.512475
N  -3.03602 -3.248287 -0.371185
N  1.396589 -0.136614 1.341306
N  4.822411 1.46926 -0.722281
C  -5.927724 0.281361 -0.404494
C  -4.842865 -0.615707 -0.997744
C  -5.929444 1.675665 -1.08461
C  -7.021998 2.601862 -0.499647
C  2.507362 0.368598 0.618598
C  3.355938 -0.476496 -0.167645
C  2.833331 1.75823 0.749104
C  -1.937479 -2.436324 -0.002244
C  0.314659 -0.905734 0.862881
C  4.49142 0.144536 -0.847611
C  4.028683 2.252838 0.073606
C  -7.041807 3.992571 -1.169064
C  -1.696888 -2.222005 1.388939
C  -1.045863 -1.842909 -0.946436
C  -0.595147 -1.46532 1.80951
C  0.074795 -1.108129 -0.527071
C  3.189793 -1.901938 -0.274093
C  2.029582 2.691217 1.493788
C  5.346318 -0.675345 -1.66661
C  4.392846 3.636939 0.226456
C  4.052203 -2.664708 -1.057072
C  2.410317 4.026198 1.614683
C  5.130598 -2.044679 -1.776887
C  3.611362 4.501709 0.986172
H  -6.919473 -0.1930 -0.533894
H  -5.758276 0.394512 0.682702
H  -5.012479 -0.900673 -2.049245
H  -3.820034 -0.23417 -0.837918
H  -6.092737 1.561942 -2.175929
H  -4.936692 2.155305 -0.959766
H  -6.858629 2.714058 0.590948
H  -8.011732 2.117191 -0.619052
H  -3.071746 -3.46734 -1.386988
H  1.284881 0.229549 2.289544
H  -7.2352 3.908532 -2.255044
H  -6.073285 4.511392 -1.03925
H  -7.829342 4.635157 -0.73514
H  -2.384243 -2.668422 2.112853
H  -1.228975 -1.975933 -2.020824
H  -0.416343 -1.320156 2.882075
H  0.750081 -0.67224 -1.268534
H  2.381869 -2.392491 0.275202
H  1.086911 2.360448 1.944555
H  6.17375 -0.172294 -2.176038
H  5.302247 3.969391 -0.283144
H  3.914378 -3.749564 -1.119598
H  1.78377 4.724753 2.179863
H  5.791348 -2.659988 -2.397165
H  3.898357 5.553091 1.095842
