program: Gaussian 09
title: 000149283
version: EM64L-G09RevD.01
frameworkgroup: C1[X(C10H12N2O4)]
method: RPBEPBE
basis: SDD
operation: Freq
keyword: #p
keyword: freq=noraman
keyword: PBEPBE/SDD
title: #p freq=noraman PBEPBE/SDD
converged: YES YES NO NO
title: Mulliken charges:
elementType: O O O O N N C C C C C C C C C C H H H H H H H H H H H H
charge: -0.291976 -0.211798 -0.221380 -0.214069 -0.369603 -0.378236 0.092790 -0.041298 -0.493582 -0.375129 -0.547726 0.179710 0.167005 -0.032152 0.159188 -0.578125 0.292615 0.241203 0.261362 0.224957 0.215865 0.254320 0.245337 0.370638 0.368276 0.229696 0.222496 0.229616
chargesum: 0.00000
title: Mulliken charges with hydrogens summed into heavy atoms:
elementType: O O O O N N C C C C C C C C C C
charge: -0.291976 -0.211798 -0.221380 -0.214069 0.001036 -0.009960 0.092790 0.251317 0.008983 0.065693 -0.048070 0.179710 0.167005 0.197544 0.159188 -0.126013
polarizability: 1.57466790e+02 6.31163613e+00 1.22762957e+02 -3.35025279e+00 1.12944344e+01 1.08173255e+02
1716.lowfreq: -8.1947 -3.9286 0.0007 0.0009 0.0010 3.7390 16.6663 57.4665 66.8299
frequency: 15.8468 57.4327 66.8199 69.7571 86.2769 121.1355 137.7602 155.7953 176.3395 200.8028 228.1289 289.6022 303.5644 350.0152 359.1810 389.4226 408.6830 425.2073 481.0791 500.7568 587.0256 624.8382 633.3043 657.3974 686.3916 723.5119 747.4179 765.2645 766.3414 782.4767 799.2733 834.4726 884.4341 919.9288 946.2563 961.8449 990.8718 995.5676 1009.4541 1012.9179 1032.6463 1055.8997 1100.6540 1113.6886 1132.3322 1157.7671 1201.2544 1231.1201 1243.5003 1269.1204 1284.9914 1297.1132 1319.6245 1331.9924 1364.3989 1378.6103 1380.2647 1401.3388 1428.3372 1452.6198 1466.4689 1483.3838 1612.1112 1649.6562 1660.0604 1681.0105 2993.6538 3009.1236 3063.2198 3064.1511 3073.8724 3087.7680 3099.4050 3129.7804 3170.5552 3201.7576 3514.7232 3518.9087
redmass: 9.9642 3.8191 3.1136 3.8226 4.0527 4.3580 6.2534 7.1968 3.5531 5.0699 3.4907 3.9899 4.4666 3.6220 11.0960 5.9492 2.2122 2.1796 8.7540 4.8753 5.0056 2.2861 4.3796 2.5692 2.7907 5.5232 5.7194 1.8892 2.9449 3.2031 2.0234 1.9033 1.4062 1.8764 2.2502 1.3210 3.5450 1.9815 1.2194 1.7051 2.3121 2.6820 2.0409 1.3166 1.4667 2.4102 2.4412 1.3499 1.5287 1.5822 1.6414 1.4903 1.4305 2.1839 9.1939 1.6285 1.9507 1.7772 1.1558 1.1259 1.1341 1.1707 6.7037 8.5480 4.6155 5.5239 1.0620 1.0589 1.0544 1.0989 1.0928 1.0786 1.0847 1.0919 1.1180 1.1150 1.0764 1.0775
irintensity: 1.2607 0.6667 3.0061 0.7220 2.1352 2.1434 0.3420 11.0573 3.6918 1.4428 1.9402 8.4763 3.6467 9.0744 25.3703 2.7997 1.8357 4.4932 16.2553 38.5658 1.7954 12.9161 4.2066 1.2235 28.1921 15.7974 5.2326 0.5738 33.2821 13.3233 219.0169 11.2567 2.2659 3.1913 9.8360 68.6546 0.5416 1.5498 19.9082 1.9879 8.2920 1.3857 1.9139 13.3965 3.5925 0.2686 36.7127 6.1028 7.1463 66.5812 73.1944 75.8735 15.9349 200.8133 221.8203 2.1999 3.2281 6.4829 12.5602 25.2664 10.2907 8.1084 293.9623 85.7759 8.6381 608.0675 12.1531 11.6174 19.7964 10.3558 1.2826 12.5964 5.8311 1.2318 26.1177 17.8774 77.0750 59.3937
temp: 298.150 k
press: 1.00000 atm
elementType: 8 8 8 8 7 7 6 6 6 6 6 6 6 6 6 6 1 1 1 1 1 1 1 1 1 1 1 1
symmnumber: 1
zpe: 561105.3 jmol-1
zpe.correction: 0.213714 hartree
zpe.thermalcorrener: 0.229204 hartree
zpe.thermalcorrenthalpy: 0.230148 hartree
zpe.thermalcorrgfe: 0.169401 hartree
zpe.sumelectzpe: -797.442395 hartree
zpe.sumelectthermal: -797.426904 hartree
zpe.sumelectthermalent: -797.425960 hartree
zpe.sumelectthermalfe: -797.486708 hartree
dipole: -0.8229 1.8780 -1.1114
dipole: 2.3322
quadrupole: -107.3664 -94.8009 -98.9241
quadrupole: 3.8839 -2.4125 -1.6335
quadrupole: -7.0026 5.5629 1.4397 3.8839 -2.4125 -1.6335
hfenergy: -797.6561085 hartree
pointgroup: C01 [X(C10H12N2O4)]
dipole: 0.1358506 -0.8185203 -0.3917649 debye
polarizability: 158.3873619|-2.0273532|119.9140531|-3.000727|-12.4641895|110.1015869 unknown
InChI: InChI=1S/C10H12N2O4/c1-2-3-10(4-6-5-16-6)7(13)11-9(15)12-8(10)14/h2,6,11-12H,1,3-5H2
charge 0 multiplicity 1
28 atoms
O  -3.568974 1.968304 0.804028
O  0.443131 -1.016083 2.261447
O  -0.276254 1.055399 -2.091538
O  3.947904 0.805347 -0.183739
N  2.153736 -0.095976 1.014046
N  1.793329 0.937561 -1.080243
C  -0.207302 -0.004498 0.124275
C  -2.498176 1.250491 0.009292
C  -1.23923 0.969748 0.814119
C  -3.791534 0.557844 0.315919
C  -0.934158 -1.316421 -0.362998
C  0.801051 -0.416501 1.215902
C  0.40943 0.696149 -1.097238
C  -0.002272 -2.307377 -1.02994
C  2.720715 0.564489 -0.08843
C  0.345638 -3.508838 -0.505454
H  -2.353693 1.657331 -0.997864
H  -0.740381 1.934135 1.034602
H  -1.517576 0.518943 1.783744
H  -4.551218 0.457666 -0.468804
H  -3.818722 -0.200256 1.109831
H  -1.721762 -1.004933 -1.073022
H  -1.413624 -1.769432 0.522327
H  2.811974 -0.383312 1.74618
H  2.188953 1.41874 -1.895361
H  0.390587 -2.016031 -2.016555
H  1.015036 -4.194304 -1.037125
H  -0.03121 -3.839284 0.4704
