program: Gaussian 09
title: 000149269
version: EM64L-G09RevD.01
frameworkgroup: C1[X(C12H11NO2)]
method: RPBEPBE
basis: SDD
operation: Freq
keyword: #p
keyword: freq=noraman
keyword: PBEPBE/SDD
title: #p freq=noraman PBEPBE/SDD
converged: YES YES NO NO
title: Mulliken charges:
elementType: O O N C C C C C C C C C C C C H H H H H H H H H H H
charge: -0.440174 -0.440170 -0.526678 0.514740 0.514741 -0.504113 -0.504116 -0.489129 -0.489129 0.317166 0.317164 -0.158893 -0.158896 -0.438652 -0.438643 0.300137 0.290200 0.290205 0.225509 0.225521 0.222670 0.222673 0.220524 0.220525 0.353410 0.353411
chargesum: 0.00000
title: Mulliken charges with hydrogens summed into heavy atoms:
elementType: O O N C C C C C C C C C C C C
charge: -0.086765 -0.086759 -0.226541 0.514740 0.514741 -0.213914 -0.213912 -0.263621 -0.263608 0.317166 0.317164 0.063777 0.063777 -0.218128 -0.218118
polarizability: 2.42036604e+02 6.22825270e-04 1.52601038e+02 1.25102646e+01 -5.10495610e-04 7.01651634e+01
1716.lowfreq: -0.3589 -0.0007 -0.0005 -0.0003 4.6788 13.0491 40.2078 50.2926 76.2643
frequency: 40.2070 50.2823 76.2621 199.5478 204.4267 221.2603 230.2865 281.7811 300.3045 348.4056 348.9984 394.1425 425.8213 445.5980 456.0939 507.2690 519.2840 522.6576 574.6160 584.2763 605.8828 640.5464 677.8757 684.0172 723.4220 756.9627 767.7503 770.2467 836.2217 837.3035 855.8655 904.6479 945.8300 945.9503 955.5123 962.0587 981.6871 982.2588 1089.8456 1091.7316 1135.9171 1143.6110 1173.7219 1175.1589 1184.7122 1214.3888 1266.7281 1271.6426 1313.8088 1315.1792 1392.3916 1398.7692 1447.7828 1478.7487 1492.7494 1497.5093 1522.2666 1591.6998 1602.2197 1625.7880 1640.7553 3120.6550 3120.8045 3128.2796 3128.5450 3156.4397 3156.7381 3185.2491 3193.2134 3545.3204 3585.8114 3585.9141
redmass: 5.4025 4.5436 6.2459 5.0824 4.4491 4.4458 4.6387 3.9815 5.8027 1.1202 1.1132 4.3056 3.4505 2.6358 3.1717 2.3844 7.3142 2.1040 6.1743 4.7222 4.3997 5.5043 1.8413 2.0242 3.6320 1.7410 1.9797 4.7521 1.4572 1.4926 1.6227 1.3920 1.3155 1.3152 3.5142 2.8451 5.1531 5.7992 1.6284 1.6443 1.4441 1.4762 1.0715 1.1128 1.5326 1.7490 1.4244 3.4243 1.2949 2.0331 3.9341 8.1731 2.7750 2.7033 3.1259 3.1861 2.1617 7.1381 3.8864 5.9956 6.4551 1.0860 1.0861 1.0917 1.0918 1.0991 1.0991 1.0923 1.0916 1.0753 1.0660 1.0660
irintensity: 0.2949 3.4738 0.5420 6.0060 0.2578 3.0550 0.6727 24.1962 3.0508 33.5449 242.5103 20.7386 0.1869 36.8118 0.2484 33.3384 2.5389 43.1439 5.1474 0.0217 13.2912 0.1557 76.5020 5.8012 17.4110 103.5541 2.7776 50.4497 3.5664 0.0001 61.1154 7.1436 0.0016 2.2972 101.6643 39.9009 23.3378 2.9464 18.3891 1.1394 115.3836 237.2121 12.9931 0.0012 65.3965 15.0800 16.8877 29.5205 31.7654 41.3542 18.6754 33.8178 33.5863 57.5736 0.1525 344.1491 196.6967 134.1759 108.2591 470.5202 70.2265 1.7401 2.6062 21.7615 27.2154 34.8711 12.9971 0.6132 0.0789 18.1430 26.4969 45.8876
temp: 298.150 k
press: 1.00000 atm
elementType: 8 8 7 6 6 6 6 6 6 6 6 6 6 6 6 1 1 1 1 1 1 1 1 1 1 1
symmnumber: 1
zpe: 529584.8 jmol-1
zpe.correction: 0.201708 hartree
zpe.thermalcorrener: 0.214548 hartree
zpe.thermalcorrenthalpy: 0.215492 hartree
zpe.thermalcorrgfe: 0.162106 hartree
zpe.sumelectzpe: -668.009710 hartree
zpe.sumelectthermal: -667.996870 hartree
zpe.sumelectthermalent: -667.995926 hartree
zpe.sumelectthermalfe: -668.049312 hartree
dipole: 0.0004 -1.6575 0.0001
dipole: 1.6575
quadrupole: -58.3036 -78.8528 -94.3683
quadrupole: 0.0001 2.3424 0.0006
quadrupole: 18.8713 -1.6779 -17.1934 0.0001 2.3424 0.0006
hfenergy: -668.2114177 hartree
pointgroup: C01 [X(C12H11N1O2)]
dipole: 0.0001967 0.6521167 0.0000103 debye
dipolederiv: -0.2063602 -0.2004399 -0.1191362 -0.4723711 -1.2488597 -0.2554137 -0.2222667 -0.2702527 -0.4919416 -0.2063361 0.2003924 -0.1191341 0.4723292 -1.2489678 0.2553495 -0.2222372 0.2701953 -0.4918766 -2.2836344 0.0000467 0.0766554 0.0000195 -0.2420797 0.0000208 0.2131105 -0.0000056 -0.3805276 1.788909 0.2553754 -0.070267 0.7749441 0.289981 0.0667381 -0.2967549 0.0704152 0.1730388 1.788689 -0.2554544 -0.0703925 -0.7749807 0.2900821 -0.066742 -0.2970132 -0.0703656 0.1730378 -0.4604299 -0.2068038 -0.0749118 -0.5079991 -0.334533 0.0011446 -0.0706334 0.0133831 -0.1854269 -0.4603508 0.2068277 -0.0749011 0.5079906 -0.3345926 -0.001156 -0.0705056 -0.0134124 -0.1853994 -0.7341234 -0.0921374 -0.0025174 0.1519009 -0.0677202 0.051422 0.0768891 0.0798854 -0.2470911 -0.7340933 0.0921538 -0.0024855 -0.1518501 -0.0677223 -0.0513921 0.0768868 -0.079879 -0.2470875 0.5425733 0.1907419 0.0055602 0.5486207 1.1920155 0.3475661 0.146728 0.3533259 0.207917 0.5424977 -0.1907513 0.0055162 -0.5486017 1.1921465 -0.347475 0.1466384 -0.3532431 0.2078563 0.3432006 0.095048 -0.0265988 0.2157779 0.2339928 0.0944987 -0.0420902 0.1055129 -0.058541 0.3431355 -0.0950362 -0.0266562 -0.2157935 0.2340014 -0.0944532 -0.0421868 -0.1054777 -0.0585528 -0.2591809 0.2112513 0.0479506 -0.1960611 -0.4325924 -0.058274 -0.0826389 -0.1165733 -0.2980326 -0.2591558 -0.2112574 0.0479118 0.1960432 -0.4325695 0.0582519 -0.0826257 0.1165918 -0.2980018 0.1024359 0.0000042 0.021398 -0.0000262 0.1236609 -0.0000224 0.2057613 -0.0000307 0.2984645 0.067483 0.0524386 0.049572 0.0743099 0.0651737 -0.0449579 0.0780313 -0.0343275 0.1384448 0.0674769 -0.0524336 0.0495846 -0.0743014 0.0651838 0.0449476 0.0780402 0.0343163 0.1384382 0.0709983 -0.0824939 -0.0038212 -0.0511773 -0.0756789 -0.0873094 0.011046 -0.0837408 0.1441814 0.0710222 0.0824841 -0.0037962 0.0511741 -0.0756823 0.0872858 0.011067 0.0837181 0.1441912 -0.0460202 0.090235 0.0659755 0.0962312 0.0218308 -0.0625594 0.0800516 -0.0584467 0.1173061 -0.0460207 -0.0902247 0.0659893 -0.0962166 0.0218437 0.0625547 0.0800718 0.058441 0.1173011 -0.0877798 -0.0873823 0.0210766 -0.1253411 0.0302481 -0.035618 0.0282516 -0.028955 0.17518 -0.0877531 0.0873941 0.0211145 0.1253575 0.0302228 0.0355921 0.0283003 0.0289273 0.1751769 0.0714055 0.0067943 0.0581426 0.1031969 0.3853014 -0.0088919 0.0840324 0.0030724 0.3659772 0.0714116 -0.0067726 0.0581707 -0.1031758 0.3853138 0.0088931 0.0840465 -0.0030744 0.3659676 unknown
polarizability: 241.6079875|-0.004469|152.6010377|-15.1654196|0.0045797|70.5937802 unknown
InChI: InChI=1S/C12H11NO2/c14-11-5-1-3-9(7-11)13-10-4-2-6-12(15)8-10/h1-8,13-15H
charge 0 multiplicity 1
26 atoms
O  -3.035258 -2.364054 -0.725631
O  3.035258 -2.364384 0.725507
N  0.000125 1.383078 0.000252
C  -1.278579 0.788499 0.082326
C  1.278783 0.788385 -0.082031
C  -1.542868 -0.5365 -0.350158
C  1.542989 -0.536665 0.350341
C  -2.354228 1.591405 0.568024
C  2.354437 1.591234 -0.567795
C  -2.857037 -1.042127 -0.274046
C  2.857104 -1.042413 0.274039
C  -3.658737 1.067132 0.621479
C  3.658897 1.066844 -0.62143
C  -3.931039 -0.257684 0.21142
C  3.931116 -0.258027 -0.211495
H  0.000189 2.404234 0.000407
H  -0.76597 -1.170129 -0.781835
H  0.766079 -1.170241 0.782072
H  -2.156932 2.613703 0.911873
H  2.157191 2.613567 -0.911563
H  -4.475208 1.692575 0.998705
H  4.475387 1.69223 -0.998706
H  -4.94773 -0.66517 0.268892
H  4.947762 -0.665603 -0.269118
H  -3.985162 -2.630438 -0.654142
H  3.985131 -2.630849 0.653914
