program: Gaussian 09
title: 000149268
version: EM64L-G09RevD.01
frameworkgroup: C1[X(C7H5Cl3OS)]
method: RPBEPBE
basis: SDD
operation: Freq
keyword: #p
keyword: freq=noraman
keyword: PBEPBE/SDD
title: #p freq=noraman PBEPBE/SDD
converged: YES YES NO NO
title: Mulliken charges:
elementType: Cl Cl Cl S O C C C C C C C H H H H H
charge: 0.075723 0.040239 0.083338 0.310398 -0.188184 -0.489271 -0.165731 0.248283 -0.074469 -0.676612 0.175533 -0.510391 0.242931 0.244263 0.233782 0.214981 0.235188
chargesum: 0.00000
title: Mulliken charges with hydrogens summed into heavy atoms:
elementType: Cl Cl Cl S O C C C C C C C
charge: 0.075723 0.040239 0.083338 0.310398 -0.188184 -0.002077 -0.165731 0.248283 -0.074469 0.007339 0.175533 -0.510391
polarizability: 1.83756506e+02 5.15307746e+00 1.45269232e+02 -8.87963978e-02 5.40006937e-02 5.41089450e+01
1716.lowfreq: -0.0027 0.0014 0.0018 1.3028 6.7706 7.4464 38.4096 45.2089 74.2910
frequency: 38.4086 45.1952 74.2903 91.8070 106.7635 165.4983 178.6571 183.3373 234.7010 246.0225 274.2409 279.1729 327.6270 344.3127 410.6448 429.8484 457.9463 558.3939 572.7506 656.7406 685.2994 747.1871 805.6900 828.4590 933.6044 980.8613 1020.4532 1069.9964 1072.8120 1164.5468 1249.8108 1297.4064 1330.3411 1398.0184 1434.5320 1452.0487 1468.3403 1476.6032 1511.9456 1585.8143 2964.2369 3002.0465 3010.5607 3099.3860 3105.3462
redmass: 1.9387 4.6109 11.1200 17.6186 5.4343 27.6197 1.1899 23.9772 14.3330 5.4731 9.0104 5.4244 11.0732 28.4429 20.2171 18.9448 6.0438 3.1477 8.7591 8.0552 4.5980 9.6062 1.4488 11.6114 5.1168 9.4794 1.7800 1.6150 3.3400 3.9623 1.1751 7.4832 2.0254 1.2045 1.1033 10.2022 1.0384 1.0526 11.6604 8.7179 1.0598 1.0361 1.0984 1.1005 1.1000
irintensity: 3.6986 0.7775 0.3365 0.0099 0.4966 0.0243 0.7188 0.0546 1.4919 0.7053 0.0761 4.6114 4.4819 3.3887 9.9131 2.2622 1.1587 1.1886 10.1274 0.0260 3.5714 56.0914 17.3003 39.7701 10.2180 22.1571 20.2240 0.5014 12.2345 142.7173 0.4742 87.8845 58.4465 24.0658 12.3516 327.3441 12.8643 14.5496 27.2648 83.4307 32.2733 27.7200 8.4001 23.7022 27.1774
temp: 298.150 k
press: 1.00000 atm
elementType: 17 17 17 16 8 6 6 6 6 6 6 6 1 1 1 1 1
symmnumber: 1
zpe: 265401.7 jmol-1
zpe.correction: 0.101086 hartree
zpe.thermalcorrener: 0.114295 hartree
zpe.thermalcorrenthalpy: 0.115239 hartree
zpe.thermalcorrgfe: 0.059023 hartree
zpe.sumelectzpe: -2122.286781 hartree
zpe.sumelectthermal: -2122.273572 hartree
zpe.sumelectthermalent: -2122.272628 hartree
zpe.sumelectthermalfe: -2122.328844 hartree
dipole: 0.0029 -3.2511 -0.0054
dipole: 3.2511
quadrupole: -97.5179 -98.2130 -97.1345
quadrupole: -7.9278 -0.0152 0.0222
quadrupole: 0.1039 -0.5912 0.4873 -7.9278 -0.0152 0.0222
hfenergy: -2122.387867 hartree
pointgroup: C01 [X(C7H5Cl3O1S1)]
dipole: -0.0222114 -1.228136 -0.3566982 debye
dipolederiv: 0.0207386 0.0460121 0.0119025 -0.0678232 -0.5776412 -0.1848811 -0.0212371 -0.1750083 -0.0149738 -0.45525 -0.2758592 -0.1214783 -0.2715743 -0.1645254 -0.0780291 -0.1200337 -0.0781871 -0.0095869 -0.5840478 0.3541567 0.0466612 0.3972168 -0.2768083 -0.0617045 0.0593841 -0.0654559 0.0422175 -0.0945845 -0.0614118 -0.0411784 -0.0830913 -0.2856394 -0.1409132 -0.0470603 -0.1388081 0.1294834 -0.9450861 0.1243175 -0.0230328 0.4482676 -0.5938371 -0.0533798 0.0722368 -0.0817983 -0.2914494 -0.1620808 -0.0949003 -0.0551353 -0.279395 -0.2119423 -0.1250757 -0.104302 -0.1062308 0.1068868 -1.2342054 -0.1172869 -0.1271512 -0.2987122 0.1152243 0.0560579 -0.1806306 0.0723986 -0.164926 1.9398521 0.0515361 0.169684 -0.0916586 0.6387319 0.1307906 0.1261498 0.1422205 0.2085092 0.3037871 -0.3245943 -0.0693054 0.018858 0.8197793 0.2361226 0.0316829 0.2062481 0.0774773 -0.0184439 0.0232883 -0.0013554 0.0052813 0.0811521 0.0054462 -0.0061864 0.0058414 0.0626397 0.4390211 0.6366049 0.2235752 0.7275425 -0.2038833 0.0084615 0.2498353 0.0003187 0.0050811 0.7208828 -0.3547996 -0.0253494 -0.5643676 0.5829135 0.1659063 -0.087093 0.184198 -0.113407 -0.0258008 0.0204608 0.0948464 0.0146808 0.0738154 -0.0429032 0.1130056 -0.0512827 -0.0346048 0.0113319 0.0494953 -0.0707424 0.0545942 -0.0018645 0.0805141 -0.0906595 0.0882349 0.0050567 0.066999 0.0032266 -0.0092618 0.0760913 -0.011228 0.1255341 -0.018012 0.0986722 -0.006832 -0.0392548 -0.0877694 -0.0383038 -0.157125 -0.0697385 -0.0630171 -0.0579922 -0.0564283 0.0848048 0.0561415 0.0075232 0.0356249 0.0712145 0.0854916 -0.0589297 0.0809125 -0.0449328 -0.0863765 unknown
polarizability: 182.6631354|-8.552903|138.6949558|8.8031624|23.777685|61.7765925 unknown
InChI: InChI=1S/C7H5Cl3OS/c1-2-3(11)6-4(8)5(9)7(10)12-6/h2H2,1H3
charge 0 multiplicity 1
17 atoms
Cl 0.399095 2.665725 0.698436
Cl 3.448244 1.312439 0.568449
Cl 3.382287 -1.99108 -0.392971
S  0.322234 -1.555686 -0.53457
O  -2.357051 1.414727 0.094547
C  -2.717779 -0.904581 -0.608721
C  -0.384842 0.081205 -0.120862
C  -1.853136 0.290238 -0.188318
C  0.641689 0.963305 0.224533
C  -4.216573 -0.565421 -0.667516
C  1.966309 0.395273 0.174806
C  1.971509 -0.93452 -0.210209
H  -2.364076 -1.269061 -1.595717
H  -2.53743 -1.737037 0.103429
H  -4.409212 0.245082 -1.390598
H  -4.801497 -1.452465 -0.96773
H  -4.580471 -0.218142 0.314111
