program: Gaussian 09
title: 000149267
version: EM64L-G09RevD.01
frameworkgroup: C1[X(C6H3Cl3OS)]
method: RPBEPBE
basis: SDD
operation: Freq
keyword: #p
keyword: freq=noraman
keyword: PBEPBE/SDD
title: #p freq=noraman PBEPBE/SDD
converged: YES YES NO NO
title: Mulliken charges:
elementType: Cl Cl Cl S O C C C C C C H H H
charge: 0.037528 0.037365 0.084163 0.421732 -0.221647 -0.142418 -0.131875 0.168578 0.271680 -0.534444 -0.753119 0.250928 0.250685 0.260844
chargesum: 0.00000
title: Mulliken charges with hydrogens summed into heavy atoms:
elementType: Cl Cl Cl S O C C C C C C
charge: 0.037528 0.037365 0.084163 0.421732 -0.221647 -0.142418 -0.131875 0.168578 0.271680 -0.534444 0.009338
polarizability: 1.65463174e+02 2.09811193e+00 1.36016001e+02 9.77531224e-03 2.45462034e-03 4.51767026e+01
1716.lowfreq: -1.9271 -0.0013 -0.0006 0.0009 3.0616 6.6260 62.6982 75.9954 103.8474
frequency: 62.6850 75.9951 103.8474 147.5241 166.9511 167.7519 189.7934 234.2178 278.5849 291.3095 316.4643 340.8325 400.6998 425.3397 462.7460 558.5203 592.4064 647.7397 652.1983 774.1041 817.5965 920.0706 985.8783 1023.4790 1025.2933 1255.4883 1302.5236 1376.8435 1436.3837 1451.7389 1459.1728 1517.7599 1559.1754 2995.3740 3082.4425 3127.9695
redmass: 3.9502 21.4296 21.8232 8.0583 27.7682 1.0281 22.0512 13.2742 9.7674 4.6512 16.1602 30.5086 13.5389 12.1775 7.9161 5.0746 3.9610 8.2592 7.7821 10.6774 11.3320 4.5247 6.8415 2.3473 1.7295 5.7776 11.5974 1.2345 1.1357 1.0476 9.3684 11.7113 6.9729 1.0364 1.0966 1.1010
irintensity: 3.7216 1.0024 0.8984 5.3085 0.1063 0.7024 0.4580 2.1066 0.5144 2.7198 5.7762 0.4247 4.2500 2.6648 0.7942 33.1168 2.5552 6.3549 0.3542 45.6053 25.2125 0.7112 21.7176 14.3819 6.3095 201.4796 76.9208 50.0850 63.3556 23.3450 257.4738 19.2575 122.8225 0.3518 6.3149 11.0575
temp: 298.150 k
press: 1.00000 atm
elementType: 17 17 17 16 8 6 6 6 6 6 6 1 1 1
symmnumber: 1
zpe: 192759.7 jmol-1
zpe.correction: 0.073418 hartree
zpe.thermalcorrener: 0.085019 hartree
zpe.thermalcorrenthalpy: 0.085963 hartree
zpe.thermalcorrgfe: 0.034346 hartree
zpe.sumelectzpe: -2083.067226 hartree
zpe.sumelectthermal: -2083.055625 hartree
zpe.sumelectthermalent: -2083.054681 hartree
zpe.sumelectthermalfe: -2083.106299 hartree
dipole: -0.0139 1.8271 0.0007
dipole: 1.8271
quadrupole: -89.2029 -97.0018 -90.8222
quadrupole: -10.1955 -0.0066 -0.0028
quadrupole: 3.1394 -4.6595 1.5201 -10.1955 -0.0066 -0.0028
hfenergy: -2083.1406446 hartree
pointgroup: C01 [X(C6H3Cl3O1S1)]
dipole: 0.0626266 -0.7034981 -0.1338542 debye
dipolederiv: -0.0906654 -0.1999207 -0.0567262 -0.1081857 -0.5872745 -0.1388118 -0.0380784 -0.1520664 -0.0161111 -0.3570316 0.3317046 0.0112441 0.3498023 -0.3288051 -0.0202309 0.0148431 -0.0227689 0.0219305 -0.6407535 -0.2485551 -0.1533239 -0.2768465 -0.1271082 -0.0780988 -0.1597446 -0.0742473 0.0173175 0.0461493 0.0086756 -0.0233286 -0.0999114 -0.2360918 -0.1066099 -0.0453443 -0.0909329 0.1908647 -0.8960048 0.1558344 -0.0560488 0.4071531 -0.7539921 -0.0315375 -0.0046416 -0.0689867 -0.3172754 -1.1004715 0.3121233 -0.0791879 0.3517669 -0.0039211 0.0781334 -0.0711726 0.072408 -0.1283922 0.5346962 0.3992393 0.1594076 0.1459738 0.7289806 0.1685346 0.1074674 0.2058309 0.0570149 0.1110578 -0.709243 -0.1248746 -0.9129361 0.1673591 -0.0961625 -0.1662567 -0.0662991 -0.0586965 1.7404117 -0.2265623 0.1865807 -0.2432706 0.8103932 0.095048 0.1829514 0.0977347 0.2122047 0.8014608 0.3019937 0.2049643 0.591256 0.3804574 0.1994719 0.26459 0.1573937 -0.0998373 -0.2362797 -0.1762289 -0.0741393 -0.2853868 -0.2472149 -0.0970614 -0.0954149 -0.0807316 -0.0068574 0.0984693 0.0158573 -0.0536524 -0.0087036 0.0357762 0.0799039 -0.0216767 0.0826636 0.0134594 0.0682918 0.0088838 0.0852311 -0.0014778 0.0908755 -0.0543236 0.0456975 -0.051937 -0.011651 -0.0793306 0.0261981 -0.0261461 0.0907665 0.0705658 0.0017445 -0.0132196 -0.0080608 0.1260293 unknown
polarizability: 163.13499|-2.6693033|132.3520645|16.8347641|17.3023394|51.1688228 unknown
InChI: InChI=1S/C6H3Cl3OS/c1-2(10)5-3(7)4(8)6(9)11-5/h1H3
charge 0 multiplicity 1
14 atoms
Cl -0.470892 -2.416038 -0.714133
Cl 2.748673 -1.762006 -0.10948
Cl 3.295153 1.549441 0.644701
S  0.239777 1.833641 0.252015
O  -2.617024 1.797825 -0.17643
C  -0.74179 0.357995 -0.192249
C  0.085936 -0.760568 -0.297825
C  1.479328 -0.503581 -0.04094
C  -2.190374 0.614559 -0.354979
C  1.723595 0.825618 0.264821
C  -3.130712 -0.518483 -0.724205
H  -3.104262 -1.323382 0.032174
H  -2.845082 -0.976438 -1.688038
H  -4.150726 -0.111182 -0.79553
