program: Gaussian 09
title: 000149263
version: EM64L-G09RevD.01
frameworkgroup: C1[X(C5H4N2O)]
method: RPBEPBE
basis: SDD
operation: Freq
keyword: #pfreq=noraman
keyword: PBEPBE/SDD
title: #p freq=noraman PBEPBE/SDD
converged: NO NO NO NO
title: Mulliken charges:
elementType: O N N C C C C C H H H H
charge: -0.164321 0.050681 -0.001621 -0.257166 -0.157226 -0.016401 -0.154162 -0.314750 0.268174 0.252786 0.242288 0.251718
chargesum: 0.00000
title: Mulliken charges with hydrogens summed into heavy atoms:
elementType: O N N C C C C C
charge: -0.164321 0.050681 -0.001621 0.011008 0.095559 -0.016401 0.088126 -0.063032
polarizability: 1.06494240e+02 -1.51872845e+00 7.14850489e+01 -9.26034647e-03 1.08846939e-03 2.79070922e+01
1716.lowfreq: -11.9318 -2.5772 -0.0014 -0.0012 -0.0009 28.5616 84.0464 210.5772 227.9178
frequency: 83.9906 210.5365 227.9178 396.0037 423.0439 455.8937 604.0535 678.8225 733.4481 784.9992 785.2759 912.9969 952.2326 972.1989 1010.0724 1024.8327 1076.3209 1117.2275 1159.7864 1290.6773 1321.8952 1373.4357 1411.5969 1435.8642 1555.5770 1560.2438 3132.7629 3150.3016 3164.1137 3178.3453
redmass: 8.9421 6.5236 7.8504 3.2077 9.1258 3.4282 7.3770 7.9259 2.7031 1.4756 8.4615 1.2768 6.5151 1.4535 1.3611 2.4555 1.7720 3.5576 1.1005 1.5396 6.9416 6.3257 2.0900 2.2899 5.6918 5.6050 1.0893 1.0893 1.0941 1.1016
irintensity: 0.6801 0.0266 0.0399 3.9119 2.0638 0.1194 3.6592 17.3799 11.4390 79.1135 41.5804 0.3442 18.4171 2.6801 0.1040 4.0239 46.1093 33.0223 3.7302 9.6334 13.8190 56.2474 27.4027 30.3474 1.7456 11.8873 10.1579 6.4365 9.4319 13.3679
temp: 298.150 k
press: 1.00000 atm
elementType: 8 7 7 6 6 6 6 6 1 1 1 1
symmnumber: 1
zpe: 216431.2 jmol-1
zpe.correction: 0.082434 hartree
zpe.thermalcorrener: 0.088827 hartree
zpe.thermalcorrenthalpy: 0.089771 hartree
zpe.thermalcorrgfe: 0.051552 hartree
zpe.sumelectzpe: -376.998515 hartree
zpe.sumelectthermal: -376.992123 hartree
zpe.sumelectthermalent: -376.991178 hartree
zpe.sumelectthermalfe: -377.029398 hartree
dipole: -5.7909 1.5375 0.0006
dipole: 5.9915
quadrupole: -47.4360 -42.8680 -46.3503
quadrupole: 1.6464 0.0018 -0.0011
quadrupole: -1.8845 2.6834 -0.7989 1.6464 0.0018 -0.0011
hfenergy: -377.0809495 hartree
pointgroup: C01 [X(C5H4N2O1)]
dipole: -2.2970907 0.5290911 0.0002282 debye
dipolederiv: -0.8749964 -0.0681391 0.0001486 0.5806613 -0.2175233 -0.0001934 0.0003616 -0.0000571 -0.0935764 -0.2019306 -0.1004763 -0.0000204 0.1175902 -0.3673821 0.000033 0.0000673 0.0000123 -0.175475 1.4259747 0.1172543 -0.0002842 -0.1674533 0.1132725 0.0002258 -0.0002336 0.0001444 -0.2066333 -0.0667875 0.128936 0.0000483 -0.0237208 0.0251941 0.0000609 -0.0000388 -0.0000131 -0.0677985 0.1429116 -0.1751408 -0.0000013 -0.1366607 0.0627509 -0.0000155 0.0000549 -0.0000258 -0.1317854 -0.5145494 0.0322248 0.0000567 -0.3890155 0.1181368 -0.0001206 -0.0002599 -0.0001125 0.1925737 0.1709489 0.1195796 0.0000001 -0.1338819 -0.1508314 0.0000564 0.0000236 0.0000383 -0.0577586 -0.1707185 0.0218029 0.0000639 0.222479 0.3975861 -0.0000816 0.0000661 -0.0000309 -0.0770085 0.1047616 -0.052095 -0.0000058 -0.0330086 -0.0116735 0.0000011 0.0000081 0.0000165 0.1706184 0.0089813 0.0869052 -0.0000051 0.0953606 0.0108077 0.000006 -0.0000281 0.0000012 0.1537975 -0.0683553 -0.0489331 -0.0000045 -0.0461956 0.0913028 0.000004 -0.0000125 0.0000047 0.1615166 0.0437595 -0.0619186 0.0000039 -0.0861546 -0.0716406 0.0000239 -0.0000088 0.0000219 0.1315295 unknown
polarizability: 106.5563937|-0.3560034|71.4228957|-0.0092913|0.000781|27.9070922 unknown
InChI: InChI=1S/C5H4N2O/c8-7-5-3-1-2-4-6-5/h1-4H
charge 0 multiplicity 1
12 atoms
O  2.817215 -0.280115 -0.000763
N  0.181645 -1.101223 0.000263
N  1.952055 0.656317 -0.000054
C  -0.382734 1.294977 0.000212
C  -1.764236 0.9941 0.000119
C  0.537829 0.217348 0.000154
C  -2.153785 -0.363417 0.000135
C  -1.14766 -1.371996 0.000271
H  0.006133 2.318177 0.000219
H  -2.511276 1.793848 0.000052
H  -3.209974 -0.651671 0.000116
H  -1.427514 -2.432245 0.000375
