program: Gaussian 09
title: 000149255
version: EM64L-G09RevD.01
frameworkgroup: C1[X(C11H14O)]
method: RPBEPBE
basis: SDD
operation: Freq
keyword: #pfreq=noraman
keyword: PBEPBE/SDD
title: #p freq=noraman PBEPBE/SDD
converged: YES YES NO NO
title: Mulliken charges:
elementType: O C C C C C C C C C C C H H H H H H H H H H H H H H
charge: -0.302673 -0.068343 -0.289465 -0.399750 0.486841 -0.352044 -0.410991 -0.377981 -0.686381 -0.228209 -0.230296 -0.239779 0.237371 0.219910 0.210014 0.207099 0.208421 0.199270 0.229562 0.261695 0.213154 0.211840 0.219441 0.226138 0.226248 0.228908
chargesum: 0.00000
title: Mulliken charges with hydrogens summed into heavy atoms:
elementType: O C C C C C C C C C C C
charge: -0.302673 0.169028 -0.069554 0.017362 0.486841 0.055648 -0.181430 -0.116286 -0.041946 -0.002071 -0.004048 -0.010871
polarizability: 1.58272880e+02 -1.15162920e+01 1.07869887e+02 -1.09646603e+01 -1.37201700e+01 8.75436090e+01
1716.lowfreq: -14.3022 -3.0202 -0.0005 -0.0003 0.0006 5.8095 35.2267 53.4168 67.4295
frequency: 35.0950 53.3433 67.4228 82.6728 132.1921 187.0276 230.0618 256.8843 301.2480 373.7986 395.7373 404.0681 435.0072 530.9202 603.3955 614.2920 703.6568 725.5491 745.1176 763.6685 800.4530 823.4263 854.0465 880.2982 893.1443 921.0248 976.1496 988.5250 993.2207 996.4251 1026.1619 1043.9183 1051.5975 1070.0717 1085.6624 1112.5490 1148.9226 1172.0020 1183.3812 1200.6481 1220.1609 1240.7977 1274.5649 1289.0206 1302.9469 1334.9676 1349.2251 1385.7780 1391.0179 1413.5937 1446.5434 1465.5902 1474.2527 1477.2939 1486.5558 1486.7194 1592.2867 1615.8541 2971.0728 2975.1459 2982.4981 3013.8426 3041.1356 3063.8575 3072.2791 3076.1130 3077.8685 3116.0667 3126.6497 3138.7862 3150.2739 3164.3827
redmass: 3.4352 4.0972 1.7797 3.0375 3.3322 4.0330 1.1498 3.0016 3.1161 4.8325 4.5885 2.8997 3.2555 3.3656 5.3476 6.4378 1.9468 2.0293 1.4960 2.4688 2.2683 5.1787 1.2485 1.4848 1.7433 1.4300 1.3929 5.4095 1.7156 1.5069 2.0467 1.7251 1.3673 1.8800 1.6584 1.9131 1.9300 1.0567 1.1222 2.2947 1.3917 1.4031 1.2813 1.1395 1.5119 1.2755 1.5419 6.1977 1.2218 2.5716 2.2460 1.0801 1.0603 1.0428 1.6966 1.3617 6.0908 6.0651 1.0576 1.0383 1.0597 1.0997 1.1001 1.0934 1.0995 1.0994 1.0894 1.0870 1.0864 1.0915 1.0957 1.1014
irintensity: 0.1518 0.5342 0.2038 1.7152 0.0898 5.0981 0.1214 0.0842 0.7664 0.3086 3.9305 0.1155 9.5538 18.2272 8.6200 0.0724 39.2669 33.4349 12.2873 55.9662 5.0129 19.0913 0.1251 8.4921 4.6926 1.9176 0.3381 0.5762 9.0477 5.2047 3.3344 3.1299 5.3867 1.9705 13.6908 3.8214 1.0029 0.2199 0.8801 6.1620 0.3512 0.2094 1.6887 1.4257 7.2937 2.3843 0.7196 1.2235 10.3786 5.3726 13.6780 1.5818 4.0101 12.5997 8.9724 25.9591 0.7237 7.0331 16.9738 28.7064 56.9897 2.1711 13.1623 4.7585 57.1116 45.0839 67.7055 9.8250 0.3696 19.0613 29.6615 22.3451
temp: 298.150 k
press: 1.00000 atm
elementType: 8 6 6 6 6 6 6 6 6 6 6 6 1 1 1 1 1 1 1 1 1 1 1 1 1 1
symmnumber: 1
zpe: 574685.6 jmol-1
zpe.correction: 0.218886 hartree
zpe.thermalcorrener: 0.230715 hartree
zpe.thermalcorrenthalpy: 0.231659 hartree
zpe.thermalcorrgfe: 0.179588 hartree
zpe.sumelectzpe: -501.855626 hartree
zpe.sumelectthermal: -501.843798 hartree
zpe.sumelectthermalent: -501.842854 hartree
zpe.sumelectthermalfe: -501.894924 hartree
dipole: -0.6068 -2.2081 -1.0333
dipole: 2.5123
quadrupole: -64.3372 -74.9270 -72.1763
quadrupole: -0.4429 -1.4637 -7.0009
quadrupole: 6.1429 -4.4468 -1.6961 -0.4429 -1.4637 -7.0009
hfenergy: -502.0745127 hartree
pointgroup: C01 [X(C11H14O1)]
dipole: -0.2518813 -0.8862494 -0.357909 debye
dipolederiv: -0.6249122 -0.0534677 -0.0073504 0.0983377 -0.6661293 -0.1622701 0.0506348 -0.1600195 -0.338048 0.5055091 0.0956231 0.0060511 -0.0029654 0.243186 0.0837563 0.088405 -0.0337108 0.2462706 0.2023933 0.0069156 -0.0590532 -0.1317308 0.2491659 -0.0287301 -0.2930886 0.0995529 0.2664339 -0.090425 -0.1059975 0.0160592 -0.0161987 0.033256 -0.0634557 -0.0485984 -0.0308473 0.0930102 0.2744224 -0.0914863 0.0020462 -0.0718479 -0.0460359 0.0150357 -0.0396008 0.0166273 -0.0698311 0.003715 -0.0153313 -0.0016575 0.0490526 0.102434 -0.0109642 0.0835368 -0.011554 0.1602673 -0.1445056 0.0599962 -0.0838413 0.0738058 -0.0517237 -0.0964123 -0.0419394 -0.105699 -0.0575441 -0.1855802 -0.0288719 -0.0054579 -0.0862386 0.014075 -0.0607566 0.0132865 -0.0415769 -0.1058367 -0.027905 -0.0363972 0.0098637 -0.0882792 0.0541368 -0.0213536 -0.0264667 -0.0164274 0.0834079 -0.0224301 -0.0816463 -0.0099667 -0.1036825 0.0596623 -0.0878688 -0.0017681 -0.0900556 -0.0851274 0.0058796 0.0338689 -0.0924793 0.0554587 -0.0019775 -0.1115975 -0.1020436 -0.1090698 -0.0368911 0.0108868 -0.054749 -0.0747859 -0.0486405 -0.0918017 -0.0216865 -0.0588864 -0.0272743 -0.1167511 -0.0145129 -0.0358178 0.0497013 -0.0206267 0.0820965 -0.0028123 0.0382012 -0.0171857 -0.1187752 -0.0045129 0.0200858 0.0648622 0.0035806 0.001193 0.0963568 0.0978571 0.0742548 -0.040913 -0.091869 0.0990742 -0.0514799 0.0855561 -0.0657999 0.0462085 -0.0481464 0.0759567 0.05255 0.0579342 -0.0122538 0.0079336 -0.030718 0.0626549 0.0136725 0.0543564 -0.0231273 -0.1432209 -0.0332742 0.1005663 -0.0524777 0.0965188 -0.0794952 0.043169 -0.0665257 0.07616 0.0365464 0.0341443 -0.014582 0.0767195 -0.0196303 0.0572755 0.012987 0.0652512 -0.0255067 -0.1714182 0.0400449 -0.0605495 0.105172 -0.0468365 0.046231 0.0869918 0.0938703 0.0955394 0.0384337 0.1057475 0.0754856 -0.015994 0.0643017 0.0026675 0.0705804 -0.0232268 0.0511266 0.1118088 0.0474659 -0.0070512 0.0280181 0.0103148 0.0954124 -0.0050653 0.0962825 0.0150493 -0.1664849 -0.0173125 0.0703409 -0.0389834 0.143229 -0.0541652 0.0912525 -0.0582852 0.0842476 0.0458506 -0.0028078 -0.0760793 -0.0300285 -0.1310832 -0.1179259 -0.0968527 -0.0465502 -0.0996597 0.0546062 0.0454212 0.0891712 -0.009716 0.1052092 -0.0499924 0.091503 -0.0145816 0.0926683 0.1012223 0.0240365 -0.045629 0.088237 -0.0569807 0.0289118 0.1053092 0.105363 0.0981806 0.0450753 -0.0975532 0.0687818 0.0786077 0.070094 0.0926881 0.0130029 0.0826631 0.0123508 0.1153584 unknown
polarizability: 157.9995364|-12.9542499|106.6831941|-9.8873268|-14.7365912|89.003646 unknown
InChI: InChI=1S/C11H14O/c1-2-6-10-11(12-10)9-7-4-3-5-8-9/h3-5,7-8,10-11H,2,6H2,1H3
charge 0 multiplicity 1
26 atoms
O  -0.773484 1.857922 0.732887
C  -1.439236 0.820836 -0.142674
C  -0.375514 0.395325 0.8377
C  -2.912163 0.558887 0.103528
C  1.012954 0.034019 0.420233
C  -3.378722 -0.780307 -0.520321
C  1.610057 -1.15282 0.916465
C  1.745949 0.855066 -0.475188
C  -4.887361 -1.032752 -0.313303
C  2.909678 -1.526391 0.508163
C  3.046246 0.484018 -0.878752
C  3.631026 -0.710308 -0.39358
H  -1.128087 0.893987 -1.196601
H  -0.732606 -0.078985 1.763885
H  -3.506783 1.39372 -0.318961
H  -3.100937 0.556618 1.194722
H  -2.796588 -1.612764 -0.077203
H  -3.148578 -0.782351 -1.604938
H  1.056189 -1.785611 1.621491
H  1.299468 1.795835 -0.816422
H  -5.141563 -1.061574 0.762911
H  -5.491365 -0.231193 -0.778478
H  -5.198864 -1.994102 -0.760645
H  3.360602 -2.446642 0.896323
H  3.6086 1.127913 -1.564418
H  4.641582 -0.995745 -0.706525
