program: Gaussian 09
title: 000149258
version: EM64L-G09RevD.01
frameworkgroup: C1[X(C14H12N)]
method: RPBEPBE
basis: SDD
operation: Freq
keyword: #p
keyword: freq=noraman
keyword: PBEPBE/SDD
title: #p freq=noraman PBEPBE/SDD
converged: NO YES NO NO
title: Mulliken charges:
elementType: N C C C C C C C C C C C C C C H H H H H H H H H H H H
charge: -0.123824 0.276619 0.297410 0.226236 0.364275 -0.364486 -0.344363 -0.304906 -0.343512 -0.354917 -0.617628 -0.236183 -0.227846 -0.208564 -0.223329 0.283646 0.245649 0.271444 0.250129 0.257173 0.251445 0.280131 0.280130 0.265593 0.265526 0.264793 0.269359
chargesum: 1.00000
title: Mulliken charges with hydrogens summed into heavy atoms:
elementType: N C C C C C C C C C C C C C C
charge: -0.123824 0.276619 0.297410 0.226236 0.364275 -0.080840 -0.098714 -0.033461 -0.093383 -0.097745 0.194078 0.029409 0.037679 0.056229 0.046031
polarizability: 2.51235416e+02 -4.62309962e+00 1.73966045e+02 2.14518187e-03 3.58672123e-03 6.13251812e+01
1716.lowfreq: -10.3976 -6.1160 -0.0006 0.0004 0.0005 7.0241 85.7048 99.2728 140.1506
frequency: 85.6993 99.2721 140.1462 228.0537 240.4180 246.1347 292.4345 316.0203 407.6605 410.0358 427.4147 430.5857 494.9452 498.2886 536.8539 555.7153 591.2647 610.3653 648.4385 705.1167 729.1819 770.8258 772.8937 776.3382 792.2433 875.6601 879.1027 885.2413 936.5905 970.9227 984.8547 991.1176 1010.8012 1018.2256 1020.8324 1037.8053 1048.9543 1113.0586 1116.4757 1121.3913 1163.8716 1193.2485 1196.0859 1219.0333 1260.8284 1279.3106 1300.8972 1327.5905 1390.8093 1400.7504 1419.9788 1428.8673 1439.9132 1451.3692 1461.8916 1472.9874 1489.0841 1511.0632 1536.4792 1570.9212 1599.4872 1617.0927 1624.4443 3020.2475 3120.0127 3143.3134 3146.5383 3156.9074 3159.3898 3169.2501 3172.8859 3176.7661 3182.9380 3187.4647 3193.3699
redmass: 3.6204 3.7866 3.4720 1.2119 4.5983 2.9961 3.1397 3.0729 6.3394 3.1068 5.9868 3.1851 3.1212 5.9440 3.0185 4.2157 3.1563 6.9141 5.8552 5.4481 3.1930 1.6593 1.4132 5.3049 1.8345 4.9129 1.5206 1.4867 1.5075 1.3746 1.3913 7.3460 1.3680 1.3794 4.7350 2.2554 2.2375 2.1850 1.5859 1.3574 1.3734 1.0836 1.1252 2.1018 1.6687 1.9148 1.6066 2.4160 2.4124 5.2249 2.3174 1.9742 2.4309 2.0387 2.0897 1.0407 1.4304 1.9663 3.8836 6.4604 5.3936 6.3108 6.0730 1.0341 1.1037 1.1029 1.0901 1.0893 1.0883 1.0917 1.0944 1.0943 1.0972 1.0977 1.0988
irintensity: 0.1320 0.7085 6.0912 0.0131 0.3088 2.1103 0.7602 0.9526 1.7584 4.9650 1.5568 5.0287 4.8575 2.2390 0.0826 1.9662 0.0100 2.8873 0.7362 3.9146 26.0080 11.3132 136.5289 2.6158 0.3524 1.0151 0.0718 4.5924 17.0580 0.2171 3.6018 1.6919 0.0005 0.0797 5.0441 2.4547 1.1854 0.6664 11.7352 1.0186 11.7390 0.7412 5.9203 17.1514 2.8635 20.3189 0.0309 4.6278 5.7634 10.6394 20.7092 23.4591 3.6268 33.5086 54.9627 24.9085 1.5699 26.5193 30.2136 2.5425 15.5494 5.7485 114.0278 5.4371 2.3279 3.4907 1.1035 0.6058 0.6530 1.4413 1.8824 0.9405 3.9623 6.0797 1.8974
temp: 298.150 k
press: 1.00000 atm
elementType: 7 6 6 6 6 6 6 6 6 6 6 6 6 6 6 1 1 1 1 1 1 1 1 1 1 1 1
symmnumber: 1
zpe: 580203.6 jmol-1
zpe.correction: 0.220988 hartree
zpe.thermalcorrener: 0.232100 hartree
zpe.thermalcorrenthalpy: 0.233045 hartree
zpe.thermalcorrgfe: 0.184365 hartree
zpe.sumelectzpe: -594.216967 hartree
zpe.sumelectthermal: -594.205854 hartree
zpe.sumelectthermalent: -594.204910 hartree
zpe.sumelectthermalfe: -594.253590 hartree
dipole: 0.6461 2.8405 0.0002
dipole: 2.9130
quadrupole: -42.7851 -49.6936 -90.4868
quadrupole: 3.1565 0.0007 0.0013
quadrupole: 18.2034 11.2949 -29.4983 3.1565 0.0007 0.0013
hfenergy: -594.4379545 hartree
pointgroup: C01 [X(C14H12N1)]
dipole: -0.2092198 1.1268185 -0.0000721 debye
polarizability: 251.4815426|1.5147365|173.7199183|0.0019997|-0.0036698|61.3251812 unknown
InChI: InChI=1S/C14H12N/c1-15-10-11-6-2-3-7-12(11)13-8-4-5-9-14(13)15/h2-10H,1H3
charge 1 multiplicity 1
27 atoms
N  -0.784402 1.767156 -0.000173
C  -0.563391 -0.690276 -0.000081
C  0.889502 -0.547774 -0.000085
C  -1.400532 0.483864 -0.000145
C  1.441582 0.787699 -0.00012
C  0.559234 1.899869 -0.000156
C  -1.210293 -1.961708 -0.000036
C  -2.818095 0.368415 -0.000188
C  1.799546 -1.642114 -0.000066
C  2.858781 1.000131 -0.000126
C  -1.635037 2.992597 -0.00024
C  -2.605655 -2.070193 -0.000067
C  -3.413371 -0.89961 -0.000152
C  3.185082 -1.418383 -0.000074
C  3.72323 -0.095664 -0.000097
H  0.953499 2.919789 -0.000189
H  -0.609382 -2.874496 0.000021
H  -3.456282 1.25413 -0.000265
H  1.432589 -2.671346 -0.000057
H  3.251773 2.022826 -0.000151
H  -0.987787 3.880974 -0.0002
H  -2.268876 3.012847 -0.901366
H  -2.268991 3.012856 0.900802
H  -3.077038 -3.057332 -0.000033
H  -4.503963 -0.986177 -0.000191
H  3.867858 -2.274187 -0.000063
H  4.806919 0.051906 -0.000101
