program: Gaussian 09
title: 000149253
version: EM64L-G09RevD.01
frameworkgroup: C1[X(C11H15Cl2NS)]
method: RPBEPBE
basis: SDD
operation: Freq
keyword: #p
keyword: freq=noraman
keyword: PBEPBE/SDD
title: #p freq=noraman PBEPBE/SDD
converged: YES YES NO NO
title: Mulliken charges:
elementType: Cl Cl S N C C C C C C C C C C C H H H H H H H H H H H H H H H
charge: -0.055249 -0.055119 0.176112 -0.185246 -0.369324 -0.370916 0.456476 -0.588281 -0.588183 -0.346820 -0.347211 -0.240643 -0.241649 -0.246954 -0.841609 0.249436 0.240014 0.240685 0.249923 0.263295 0.293570 0.292996 0.263343 0.234941 0.234781 0.251724 0.251780 0.262248 0.262180 0.253699
chargesum: 0.00000
title: Mulliken charges with hydrogens summed into heavy atoms:
elementType: Cl Cl S N C C C C C C C C C C C
charge: -0.055249 -0.055119 0.176112 -0.185246 0.120125 0.119691 0.456476 -0.031416 -0.031843 -0.111878 -0.112430 0.011081 0.010131 -0.246954 -0.063482
polarizability: 2.36152798e+02 8.00187897e-02 1.74374423e+02 1.32867687e+01 -1.45413033e-01 1.03495359e+02
1716.lowfreq: -6.7910 -0.0030 -0.0012 0.0009 5.7102 7.1123 19.8066 36.1952 36.4677
frequency: 19.7561 36.1258 36.4559 42.2202 48.5140 81.7233 113.5140 124.3288 128.8487 169.7288 193.5705 205.2331 213.5712 256.5503 313.8295 324.9870 334.7363 392.2062 419.4466 467.6103 523.9557 526.8612 603.9767 630.3151 639.9833 681.7102 683.1049 717.0162 759.4730 777.3233 789.9015 813.3608 821.2074 943.0902 951.4388 960.9786 962.0596 984.7525 986.9599 996.8339 1031.6224 1039.8645 1045.0752 1088.3031 1118.4278 1127.4990 1179.7008 1203.6571 1222.6667 1253.0976 1257.6584 1279.7581 1295.7350 1300.9844 1336.9044 1346.1097 1350.2843 1362.8120 1386.6436 1415.7015 1443.0048 1454.3214 1458.7864 1462.1634 1479.9351 1490.9704 1496.3394 1559.7348 1607.8143 3006.2551 3008.1408 3010.4289 3060.7258 3063.5206 3069.1460 3075.0905 3129.9410 3131.2105 3139.6675 3140.6884 3145.4652 3148.3930 3161.5416 3166.4864
redmass: 3.6009 5.4726 11.5530 8.2637 4.0407 3.9096 2.5812 2.6470 1.0994 4.5508 4.5610 8.9994 4.5265 3.7920 5.1956 5.9614 4.3180 5.5478 3.0095 3.1891 4.2501 2.6368 4.7758 7.1686 7.0712 6.1327 5.5470 3.5241 4.2074 1.1202 1.2271 1.2452 1.6800 1.6308 2.0496 1.2225 1.2866 1.3524 3.5276 1.4502 4.1829 1.5303 3.9417 2.6467 1.6253 1.3173 1.5673 1.1321 2.1062 1.1550 1.1657 1.3861 1.2053 1.4088 1.1314 1.5778 1.2576 4.7973 1.5177 3.3174 1.0613 1.0957 1.0549 1.0934 1.0828 2.3546 1.1327 6.9674 6.2024 1.0278 1.0610 1.0629 1.0570 1.0564 1.1021 1.1016 1.1062 1.1036 1.0883 1.0878 1.1115 1.1118 1.0948 1.0958
irintensity: 1.0763 1.5874 1.6479 0.4198 0.8760 1.0358 0.8607 1.9165 0.0174 0.4130 1.4311 8.4020 1.1851 1.5278 4.2136 1.2789 0.0499 21.2534 0.0206 0.3013 22.8524 17.9914 1.1378 1.0527 1.1815 64.4150 84.8383 1.6027 4.5157 4.1724 10.5180 0.1972 75.7877 8.1687 11.4943 3.9333 1.1142 29.4352 7.6216 4.5949 0.0368 0.5492 1.3116 2.8016 27.3976 17.3069 52.3632 21.5225 28.6075 14.4276 15.2730 49.3040 5.1698 7.8548 0.9504 85.9848 1.0265 0.1308 24.7195 3.2208 16.7186 6.1125 10.4572 20.1406 11.4687 188.7964 72.1469 4.7665 179.3112 37.6186 11.9720 37.6255 11.5993 26.2822 5.3768 16.9830 17.8459 17.1912 0.2622 18.8260 5.1972 21.4504 26.2729 8.2091
temp: 298.150 k
press: 1.00000 atm
elementType: 17 17 16 7 6 6 6 6 6 6 6 6 6 6 6 1 1 1 1 1 1 1 1 1 1 1 1 1 1 1
symmnumber: 1
zpe: 623431.1 jmol-1
zpe.correction: 0.237452 hartree
zpe.thermalcorrener: 0.254500 hartree
zpe.thermalcorrenthalpy: 0.255444 hartree
zpe.thermalcorrgfe: 0.188538 hartree
zpe.sumelectzpe: -1799.946408 hartree
zpe.sumelectthermal: -1799.929360 hartree
zpe.sumelectthermalent: -1799.928416 hartree
zpe.sumelectthermalfe: -1799.995323 hartree
dipole: -0.7037 0.0200 1.1953
dipole: 1.3872
quadrupole: -122.7975 -123.8251 -111.2181
quadrupole: 0.0965 11.0360 -0.0700
quadrupole: -3.5173 -4.5449 8.0622 0.0965 11.0360 -0.0700
hfenergy: -1800.1838606 hartree
pointgroup: C01 [X(C11H15Cl2N1S1)]
dipole: -0.2671027 0.0667044 0.471235 debye
polarizability: 236.6112577|-0.0256187|173.4187732|10.6629538|-8.312559|103.9925483 unknown
InChI: InChI=1S/C11H15Cl2NS/c1-15-11-4-2-10(3-5-11)14(8-6-12)9-7-13/h2-5H,6-9H2,1H3
charge 0 multiplicity 1
30 atoms
Cl -3.254584 3.72454 0.141066
Cl -3.431187 -3.315298 0.935655
S  4.62871 -0.076256 -0.266416
N  -1.492697 0.029977 -0.594083
C  -2.216162 1.295547 -0.805702
C  -2.27382 -1.216474 -0.521948
C  -0.081561 0.010129 -0.483174
C  -2.425517 2.066008 0.513359
C  -2.528599 -1.653475 0.934722
C  0.687571 1.211391 -0.581217
C  0.629339 -1.214508 -0.285835
C  2.093947 1.179516 -0.506687
C  2.036096 -1.232517 -0.212996
C  2.78585 -0.038832 -0.318952
C  4.903713 0.151749 1.594937
H  -1.676784 1.936596 -1.526663
H  -3.20037 1.075434 -1.254236
H  -3.243517 -1.063357 -1.026756
H  -1.758739 -2.028877 -1.066221
H  -3.103691 1.543535 1.204071
H  -1.477123 2.309925 1.013357
H  -1.59636 -1.816858 1.494517
H  -3.186937 -0.95752 1.475368
H  0.202013 2.18034 -0.728883
H  0.096949 -2.1660 -0.198369
H  2.660757 2.111896 -0.602172
H  2.557483 -2.186286 -0.078089
H  4.437906 -0.677865 2.148387
H  4.484813 1.115639 1.921998
H  5.994502 0.142803 1.749862
