program: Gaussian 09
title: 000149294
version: EM64L-G09RevD.01
frameworkgroup: C1[X(C20H16O)]
method: RPBEPBE
basis: SDD
operation: Freq
keyword: #pfreq=noraman
keyword: PBEPBE/SDD
title: #p freq=noraman PBEPBE/SDD
converged: YES YES NO NO
title: Mulliken charges:
elementType: O C C C C C C C C C C C C C C C C C C C C H H H H H H H H H H H H H H H H
charge: -0.437598 0.129290 0.292994 0.074581 -0.007594 0.254857 0.277267 0.023436 0.442812 -0.446040 -0.511085 -0.828253 -0.830596 0.187809 -0.403754 -0.405303 -0.487996 -0.265703 -0.264955 -0.434795 -0.224925 0.227250 0.234663 0.246868 0.223436 0.239773 0.233667 0.237268 0.234822 0.255225 0.242276 0.242794 0.225185 0.225287 0.214236 0.228399 0.354401
chargesum: 0.00000
title: Mulliken charges with hydrogens summed into heavy atoms:
elementType: O C C C C C C C C C C C C C C C C C C C C
charge: -0.083196 0.129290 0.292994 0.074581 -0.007594 0.254857 0.277267 0.023436 0.442812 -0.218790 -0.276422 -0.118177 -0.124839 0.187809 -0.148528 -0.163027 -0.245202 -0.040518 -0.039668 -0.220559 0.003474
polarizability: 4.07059236e+02 -8.98301240e+00 2.43933059e+02 8.67541942e+00 -1.61064211e+00 1.04418166e+02
1716.lowfreq: -10.4638 -4.1259 -0.0007 -0.0003 0.0001 6.8191 44.5007 67.5087 79.6079
frequency: 44.3246 67.4602 79.5611 106.3470 135.5652 160.0086 184.1852 205.9514 237.5447 263.5725 283.5799 298.0686 312.6548 330.1867 342.3412 352.6509 387.8450 415.1655 423.7043 465.0818 482.2208 490.5584 511.8856 521.4150 526.3407 555.8298 566.5019 590.8535 603.5835 625.6787 638.1784 688.8334 696.3512 746.3541 748.5539 762.4565 778.9909 793.3797 810.1691 824.9117 843.2656 867.5788 875.6734 906.7729 953.6371 957.3439 972.3521 983.2655 986.2615 1024.6172 1027.2534 1035.1650 1038.2588 1054.5888 1071.6588 1077.1150 1089.1468 1137.4440 1167.4465 1177.4398 1179.8977 1191.5812 1231.5206 1245.7537 1263.8048 1292.2778 1305.7809 1343.5698 1370.2762 1381.4993 1390.7772 1393.5288 1402.6812 1417.8179 1427.8095 1432.8476 1455.8996 1457.2974 1468.1167 1477.3516 1486.2767 1493.8365 1507.4056 1552.9843 1565.6356 1569.3484 1607.3263 1612.9296 1626.1808 2978.2408 2985.6699 3045.9885 3063.7227 3107.4310 3108.4143 3115.2448 3125.2867 3128.4850 3134.1518 3141.5190 3159.1207 3160.6749 3166.1854 3168.5762 3569.7829
redmass: 2.7907 3.3727 1.6941 3.1543 2.9938 3.8396 3.9843 4.7671 3.9905 1.2574 3.6175 4.6663 2.8535 2.5250 1.8177 2.1237 3.1884 4.9912 3.4389 4.3670 4.9231 3.8167 3.8784 5.7023 5.2345 4.5841 3.7778 3.4661 3.7821 4.7807 4.6341 3.2271 4.9584 4.0023 1.6142 1.3524 2.5618 3.9516 3.1764 1.8512 3.9804 1.5342 1.8333 3.8106 1.3274 1.3605 1.3860 2.6516 1.3223 3.0502 2.7854 1.6180 1.6451 1.8821 3.6011 2.0639 2.1948 1.8258 1.1891 1.3312 1.1604 1.3578 1.8112 1.7401 2.3825 2.3383 2.8546 4.1058 3.3007 3.2985 2.1025 1.6346 1.5686 2.1187 2.6121 4.4500 1.2538 2.6491 1.2389 1.4216 1.2221 1.8023 2.0005 5.6861 5.5587 6.8552 6.4409 6.2720 6.6551 1.0417 1.0389 1.0970 1.0971 1.0964 1.0894 1.0930 1.0851 1.0884 1.0885 1.0892 1.0938 1.0993 1.0943 1.0988 1.0658
irintensity: 0.5845 0.6144 0.3138 0.4389 2.1724 2.6444 2.7232 2.8798 1.1103 6.6589 3.0606 0.8705 25.5051 15.4708 44.8702 16.7439 0.2403 2.1543 6.7094 6.8732 1.0357 2.0111 1.6087 0.3850 1.1682 0.1736 4.5588 3.0582 4.9303 2.0122 0.9276 21.1775 3.7171 10.8657 34.6219 87.2536 0.7556 6.5619 18.4349 29.5334 10.1248 21.0478 4.3360 11.6402 0.8417 0.7316 1.8333 42.6216 0.0082 14.6580 14.2567 3.6658 9.1663 0.7116 1.6895 8.1698 14.2005 6.5881 21.1062 3.1074 6.4278 34.5376 16.5072 28.3296 24.1102 4.0212 1.2900 14.5380 11.3613 8.8816 11.7297 18.6105 15.5298 10.6455 5.0698 1.6213 9.9467 1.1173 24.0673 9.2422 15.9716 14.3208 4.9807 9.6528 6.8450 13.7064 12.0853 1.9799 8.1974 44.0160 28.9300 18.3406 14.0008 13.5759 11.7527 17.0165 3.1008 1.1400 10.9979 11.5109 28.9728 36.4673 40.4496 34.4585 27.2167
temp: 298.150 k
press: 1.00000 atm
elementType: 8 6 6 6 6 6 6 6 6 6 6 6 6 6 6 6 6 6 6 6 6 1 1 1 1 1 1 1 1 1 1 1 1 1 1 1 1
symmnumber: 1
zpe: 775273.7 jmol-1
zpe.correction: 0.295286 hartree
zpe.thermalcorrener: 0.312070 hartree
zpe.thermalcorrenthalpy: 0.313014 hartree
zpe.thermalcorrgfe: 0.252037 hartree
zpe.sumelectzpe: -845.537119 hartree
zpe.sumelectthermal: -845.520335 hartree
zpe.sumelectthermalent: -845.519391 hartree
zpe.sumelectthermalfe: -845.580368 hartree
dipole: -1.2155 -0.6908 0.4655
dipole: 1.4736
quadrupole: -103.9227 -103.0048 -127.8414
quadrupole: 6.1147 -1.5186 -2.4674
quadrupole: 7.6669 8.5848 -16.2517 6.1147 -1.5186 -2.4674
hfenergy: -845.8324054 hartree
pointgroup: C01 [X(C20H16O1)]
dipole: 0.4722391 0.2826165 0.1822847 debye
polarizability: 407.2788701|-4.6021234|243.5394714|-10.8972364|2.6356137|104.5921186 unknown
InChI: InChI=1S/C20H16O/c1-12-15-7-3-4-8-16(15)13(2)19-17(12)11-10-14-6-5-9-18(21)20(14)19/h3-11,21H,1-2H3
charge 0 multiplicity 1
37 atoms
O  1.659136 2.355497 1.071285
C  0.355111 -0.01332 -0.123748
C  -0.152593 -1.385997 -0.010775
C  -0.566436 1.036494 -0.381096
C  -1.53798 -1.639532 0.175806
C  -1.974214 0.789819 -0.198584
C  -2.455555 -0.53559 0.152338
C  1.817842 0.180779 -0.033919
C  2.698476 -0.92414 -0.326057
C  0.790548 -2.472458 -0.233092
C  2.124704 -2.24578 -0.481599
C  -0.140869 2.366378 -0.980564
C  -2.086908 -3.042672 0.386842
C  2.455246 1.367018 0.461336
C  -2.935535 1.851961 -0.328586
C  -3.865108 -0.716952 0.380287
C  4.112968 -0.758143 -0.356841
C  -4.295449 1.641776 -0.099219
C  -4.766071 0.340901 0.26269
C  3.858821 1.526877 0.43156
C  4.690151 0.473489 -0.015062
H  0.417696 -3.499258 -0.268824
H  2.79609 -3.078208 -0.722212
H  0.897641 2.32995 -1.340958
H  -0.786137 2.604849 -1.846806
H  -0.207694 3.19952 -0.259283
H  -2.698019 -3.086324 1.307743
H  -2.739632 -3.357642 -0.450034
H  -1.297988 -3.799098 0.50094
H  -2.587919 2.856382 -0.585899
H  -4.241743 -1.708545 0.647959
H  4.742726 -1.616113 -0.616447
H  -5.003886 2.472866 -0.188921
H  -5.834171 0.178077 0.445433
H  4.304628 2.46517 0.788264
H  5.775942 0.611173 -0.044701
H  2.237381 3.048896 1.476943
