program: Gaussian 09
title: 000149278
version: EM64L-G09RevD.01
frameworkgroup: C1[X(C9H7N3O5)]
method: RPBEPBE
basis: SDD
operation: Freq
keyword: #pfreq=noraman
keyword: PBEPBE/SDD
title: #p freq=noraman PBEPBE/SDD
converged: YES YES NO NO
title: Mulliken charges:
elementType: O O O O O N N N C C C C C C C C C H H H H H H H
charge: -0.172967 -0.104830 -0.131699 -0.199984 -0.239556 -0.027974 0.089309 0.080583 -0.486744 0.294541 0.111307 -0.079201 -0.258024 -0.003315 -0.277791 0.083135 -0.581182 0.287345 0.280247 0.278685 0.280163 0.248118 0.276885 0.252949
chargesum: 0.00000
title: Mulliken charges with hydrogens summed into heavy atoms:
elementType: O O O O O N N N C C C C C C C C C
charge: -0.172967 -0.104830 -0.131699 -0.199984 -0.239556 -0.027974 0.089309 0.080583 0.080848 0.294541 0.111307 -0.079201 0.020660 -0.003315 0.002372 0.083135 0.196770
polarizability: 3.91034998e+02 9.41876249e+00 1.61000326e+02 9.73343693e+00 1.31464675e-01 8.44287928e+01
1716.lowfreq: -7.3558 -0.0012 -0.0009 -0.0007 3.5259 5.6707 21.2573 34.8231 42.1401
frequency: 21.0369 34.8066 42.1210 49.6600 69.4907 128.2188 142.2662 159.6044 168.0369 199.8551 214.4708 241.8900 278.2051 302.3687 328.0527 333.2400 341.5915 374.5650 382.3145 394.8881 448.2560 511.6591 535.5958 552.7242 607.1743 627.6739 646.2202 754.5522 765.9488 773.6221 837.0270 851.9089 872.5726 898.2420 932.7690 970.5953 989.1767 1056.3362 1116.6497 1135.4791 1147.9903 1162.0843 1230.5349 1236.5563 1245.5244 1296.3803 1309.2121 1317.3052 1336.5935 1391.1621 1410.0208 1416.9989 1431.6046 1456.9263 1481.4143 1533.1155 1544.3597 1567.0599 1590.3140 2959.1549 3004.9674 3049.1783 3097.3947 3136.5183 3145.0703 3168.2701
redmass: 7.7021 10.3631 9.0323 5.7452 6.3430 7.3513 1.5431 2.7861 4.3538 10.7389 8.7015 8.0003 4.1437 5.4720 12.5341 5.5561 4.3075 5.8028 3.6469 9.1761 7.7399 5.4147 5.8070 6.3329 5.9017 3.6746 6.0028 7.6702 7.3257 2.7035 6.0128 2.8780 7.0794 2.8976 3.8184 2.6295 1.3937 3.1293 1.3343 3.3565 1.5600 3.1548 2.8190 3.2683 2.9758 7.0007 1.7429 2.3342 3.5389 1.9939 7.0685 1.1731 1.1739 1.0470 1.0521 7.4725 10.8865 7.1482 10.1228 1.0619 1.0332 1.0952 1.1025 1.1016 1.0880 1.0987
irintensity: 6.8016 3.3422 1.7173 2.4984 8.5328 1.4333 0.8482 2.9836 0.5696 2.5872 2.9199 4.2476 2.0673 7.1493 2.3272 0.6297 17.2275 3.6717 1.8049 3.8659 2.1401 7.7883 9.2870 3.6790 5.3286 27.5597 11.4846 2.1356 12.4936 16.1226 10.2969 21.9580 5.1298 207.5145 56.2733 51.8680 2.2050 5.6151 0.1467 63.1671 22.4064 12.7441 31.4689 95.4819 57.9078 167.3127 62.3903 81.8397 259.3395 17.6429 56.3889 50.6065 19.7133 30.6539 18.7764 83.5628 346.7413 24.1886 18.7324 4.7641 16.7054 3.9755 8.1690 4.5011 0.8498 1.1200
temp: 298.150 k
press: 1.00000 atm
elementType: 8 8 8 8 8 7 7 7 6 6 6 6 6 6 6 6 6 1 1 1 1 1 1 1
symmnumber: 1
zpe: 405274.3 jmol-1
zpe.correction: 0.154361 hartree
zpe.thermalcorrener: 0.170797 hartree
zpe.thermalcorrenthalpy: 0.171741 hartree
zpe.thermalcorrgfe: 0.108074 hartree
zpe.sumelectzpe: -886.096448 hartree
zpe.sumelectthermal: -886.080012 hartree
zpe.sumelectthermalent: -886.079068 hartree
zpe.sumelectthermalfe: -886.142735 hartree
dipole: -2.2523 -1.6101 -0.0438
dipole: 2.7690
quadrupole: -127.5243 -99.6183 -99.1138
quadrupole: -21.6815 3.8129 0.2673
quadrupole: -18.7721 9.1338 9.6383 -21.6815 3.8129 0.2673
hfenergy: -886.250809 hartree
pointgroup: C01 [X(C9H7N3O5)]
dipole: -0.7288538 -0.5054682 -0.632497 debye
dipolederiv: -0.2074795 -0.2015702 0.0988291 -0.0358951 -0.7045296 0.1542633 0.093191 0.0917186 -0.3073857 -0.6090951 -0.1839376 -0.1472412 -0.5344584 -0.5003908 -0.1606352 -0.3108758 -0.13016 -0.3615233 -1.2135925 -0.029604 -0.0730861 -0.1878081 -0.2843614 -0.0082653 0.0003087 -0.0149603 -0.2822539 -0.3602174 0.6359872 0.8654878 -0.2383299 -0.036912 0.1984663 0.0145151 -0.0540585 -0.0774314 0.7751397 0.1818673 0.7141221 0.0265919 -0.2306277 -0.1094798 -0.6634641 -0.3282237 -1.0723568 1.1282924 -0.0184965 0.0712009 0.4874278 -0.2031382 -0.0152726 0.3045811 -0.0530036 -0.3800077 0.0871511 -0.781026 -1.0955324 0.178884 -0.017654 0.028849 -0.0620641 0.0982409 -0.0915672 -2.0788422 -0.0581621 -0.6320017 -0.4067676 0.0892827 0.1992189 0.3889519 0.4625644 1.0715549 -0.1712608 0.0479777 -0.16366 0.1245159 0.1342487 0.0579336 0.2984582 0.0505685 0.011681 0.4872054 -0.1593648 -0.079044 0.2642671 0.3284955 0.3311345 0.3219242 0.0766781 0.1764461 0.0437742 0.1318411 0.014363 0.1504124 0.5511434 -0.2360271 -0.0474432 -0.0304709 0.2703719 -0.6198715 0.0295947 0.1372961 -0.2854462 -0.3828416 -0.5353219 -0.0591844 -0.2311661 -0.0574254 0.2200428 0.2302601 0.2867636 -0.1250963 0.1109523 0.086424 -0.1098728 0.0670576 -0.0795203 0.9892665 0.3690344 0.234551 0.6324112 0.4444812 0.1204088 0.321471 0.1351972 0.3248436 -0.340448 -0.1852016 -0.2000834 -0.5404969 -0.0592498 -0.0022112 -0.2721591 -0.0127934 -0.113658 1.3329086 0.099932 0.1248256 0.6380164 0.2718499 0.0617688 0.2344725 0.0860886 0.2607625 0.3131761 -0.0220422 -0.0138616 -0.059254 0.1760093 0.017678 -0.2850926 -0.00536 0.1903582 -0.1401909 0.0036943 -0.0711283 -0.0703464 0.1107208 -0.0661267 -0.0689246 -0.0026079 0.0217899 0.1485552 -0.0401753 -0.0026555 -0.0317987 -0.0049864 0.0211974 -0.0561832 -0.1018229 0.0884488 0.0621363 -0.0696082 -0.0401772 0.0208316 0.0533044 -0.0680868 -0.0331409 -0.0228765 0.1305424 0.0531105 0.0351873 0.0290716 0.0086845 0.0646826 -0.0717021 -0.014523 -0.0625736 0.1126168 0.0874195 -0.0793551 -0.0156676 0.0136569 -0.0546967 -0.0345391 0.0980727 -0.0173159 0.0608208 0.0762379 0.0749974 -0.0718398 0.0491841 0.0139623 0.0483973 0.059867 0.0178246 0.0255531 -0.0634182 -0.0118299 0.0294681 -0.0791865 0.1302551 -0.0180721 -0.1528857 -0.0185452 0.0773397 unknown
polarizability: 375.5977305|23.3062773|120.9635381|54.9674822|44.2537178|139.9028478 unknown
InChI: InChI=1S/C9H7N3O5/c1-12(11-17)4-7(14)5-2-3-6(13)9(15)8(5)10-16/h2-3H,4H2,1H3
charge 0 multiplicity 1
24 atoms
O  -1.300746 -2.217583 0.396611
O  3.061714 1.582465 1.273666
O  4.709563 -0.302994 -0.066997
O  -0.969294 0.734872 1.581209
O  -3.516839 -1.257212 -2.810846
N  -3.261831 -0.482955 -0.706613
N  0.257013 1.138728 1.486002
N  -4.070592 -1.00902 -1.680078
C  -1.830674 -0.22123 -0.940532
C  0.544496 -0.775746 -0.037651
C  -0.930933 -1.096568 -0.060526
C  1.091324 0.281246 0.717243
C  1.408993 -1.682621 -0.773526
C  2.553854 0.578062 0.712069
C  2.778953 -1.52069 -0.804782
C  3.452477 -0.42962 -0.068122
C  -3.881778 -0.243885 0.606583
H  -1.638492 -0.472873 -2.005895
H  -1.612192 0.850864 -0.78814
H  0.936182 -2.523343 -1.292908
H  3.423993 -2.209099 -1.361977
H  -3.709684 0.798643 0.923685
H  -3.446265 -0.922883 1.358509
H  -4.960241 -0.437561 0.508619
