program: Gaussian 09
title: 000149310
version: EM64L-G09RevD.01
frameworkgroup: C1[X(C23H23NO2)]
method: RPBEPBE
basis: SDD
operation: Freq
keyword: #p
keyword: freq=noraman
keyword: PBEPBE/SDD
title: #p freq=noraman PBEPBE/SDD
converged: YES YES NO NO
title: Mulliken charges:
elementType: O O N C C C C C C C C C C C C C C C C C C C C C C C H H H H H H H H H H H H H H H H H H H H H H H
charge: -0.452191 -0.508256 -0.374711 0.253180 0.186449 -0.603909 0.217801 0.188145 -0.344172 -0.339660 0.514349 -0.735067 0.475649 -0.824645 -0.655476 0.416639 -0.736770 0.406841 -0.361149 -0.463986 -0.264087 -0.438164 -0.421436 -0.247705 -0.243895 -0.243983 0.224217 0.222967 0.282914 0.201461 0.188062 0.221621 0.202242 0.216084 0.252917 0.215165 0.249558 0.242280 0.250555 0.253534 0.244450 0.223558 0.244130 0.241874 0.228959 0.369804 0.365424 0.229475 0.228959
chargesum: 0.00000
title: Mulliken charges with hydrogens summed into heavy atoms:
elementType: O O N C C C C C C C C C C C C C C C C C C C C C C C
charge: -0.082387 -0.142832 -0.091797 0.253180 0.186449 -0.156725 0.217801 0.188145 0.045351 0.084203 0.514349 -0.050902 0.475649 -0.575088 -0.413196 0.416639 -0.486214 0.406841 -0.107615 -0.219536 -0.040529 -0.194034 -0.179562 -0.018746 -0.014420 -0.015024
polarizability: 4.03372175e+02 -9.23749987e+01 3.92143987e+02 1.52253214e+01 8.67215664e+00 1.32212589e+02
1716.lowfreq: -13.4384 -7.0593 -0.0008 -0.0004 0.0002 6.5032 11.5772 17.3292 39.9893
frequency: 1.6652 17.2669 39.9512 56.9591 83.5146 85.9236 101.9266 123.3554 129.9974 152.9753 163.5049 183.4476 200.0847 226.2180 240.6352 258.1028 273.9656 276.1401 301.8022 313.8445 325.6626 347.2915 367.7723 377.3532 396.2038 425.6170 428.6490 462.2446 465.7620 474.4736 501.5951 516.2107 518.0666 534.0251 559.1649 562.8337 597.0131 611.1356 620.4176 629.2789 654.8533 703.7529 738.3984 741.5583 747.0073 751.2700 757.3111 765.7156 778.9852 810.1847 848.4925 850.1455 855.5028 865.6909 884.1160 907.1829 913.7745 917.3254 931.9749 945.5639 945.6989 956.9403 963.8707 965.5453 970.5129 986.7396 989.6777 1001.2250 1008.3872 1010.1701 1028.1468 1045.5621 1084.0303 1123.4863 1133.3373 1138.6724 1150.4428 1158.4098 1169.7854 1174.0742 1181.7661 1191.7890 1216.0157 1217.9551 1226.7014 1252.1232 1257.7189 1274.6208 1287.8396 1295.1576 1319.9884 1326.0643 1334.6241 1354.6440 1375.9352 1377.7416 1388.5830 1392.7184 1413.4215 1416.0570 1419.9886 1441.8025 1444.2151 1451.6945 1455.3665 1459.5553 1461.4336 1472.5498 1475.3865 1478.5732 1519.0563 1531.6065 1551.2211 1554.1929 1568.7038 1612.4248 1623.4458 1641.4132 2917.7371 2942.3768 2956.6664 2984.3473 3005.1575 3028.6373 3034.4266 3074.3762 3115.7481 3117.2750 3118.3886 3119.5803 3121.1117 3124.4440 3132.7509 3135.3074 3143.3580 3154.4750 3162.2672 3170.9208 3401.3896 3477.8148 3601.0485
redmass: 4.8214 4.7449 4.2738 5.2888 3.9432 4.8264 3.1929 3.6101 4.3551 2.3547 3.1293 4.4406 1.5983 3.7319 1.2226 2.3142 4.8085 4.6890 4.8362 5.4697 2.9666 3.0319 2.5098 4.3145 3.1492 2.4098 2.6545 4.4939 2.4627 3.0148 3.1280 2.9659 3.4777 5.0317 2.9215 5.0079 2.5667 5.8849 6.4128 1.2704 3.9338 4.2507 3.1564 2.9729 1.4326 4.1929 1.4034 4.8998 2.3938 2.0145 1.5694 2.1080 1.5445 5.5524 1.7128 1.8586 3.0047 2.1179 1.7540 1.6639 1.8338 3.4856 1.4512 2.6092 1.4500 1.3627 1.3545 6.0651 2.3507 2.2830 3.3337 2.2301 3.4180 1.9499 1.6244 1.7934 1.4671 1.4586 1.1270 1.1202 1.2046 1.2589 1.5762 1.6445 1.4092 1.7404 1.8317 1.5824 1.8420 2.2924 2.2511 1.2457 1.7147 2.3706 2.2670 1.3612 2.0632 1.2714 1.2541 3.9463 2.9391 6.0513 3.4163 3.2888 1.1633 1.1025 1.0724 2.5258 1.0802 1.0919 4.2338 1.2772 7.5604 4.2675 5.3599 6.3134 5.9837 6.6136 1.0674 1.0684 1.0579 1.0376 1.0887 1.1010 1.0998 1.0999 1.0914 1.0970 1.0897 1.0863 1.0868 1.0886 1.0894 1.0896 1.0952 1.0960 1.1003 1.0970 1.0654 1.0760 1.0670
irintensity: 1.7436 0.6182 0.1589 0.1653 0.6525 1.6150 3.9342 1.0318 1.7104 4.8231 0.2953 0.4941 6.9406 5.9338 119.7538 14.1961 1.7126 3.8148 0.8218 0.0180 1.0499 1.5537 2.3426 2.3318 3.1001 15.9501 4.3863 0.4191 21.1092 7.2907 26.4387 29.1883 3.8199 10.5920 7.2534 4.3084 4.0977 0.7118 1.0480 139.3185 22.5986 7.8252 10.7014 0.6248 1.9938 7.8446 118.1622 3.1373 2.6368 6.2222 1.2022 2.3136 1.3246 0.5053 22.9665 23.5363 4.0506 3.7497 4.0143 3.0131 20.8045 28.9740 4.7195 43.8777 20.1100 2.2852 0.4558 165.6011 1.3256 12.4753 0.8064 3.4946 15.0872 20.6732 92.4293 5.1973 0.8306 18.4175 0.5994 0.2813 10.4374 4.4061 3.3288 0.5714 7.7103 0.5257 18.4793 13.1490 1.8781 9.1646 4.1522 7.3331 4.5440 1.1265 12.3548 12.5588 6.1272 15.9548 68.2795 5.2882 6.2239 0.6533 0.4296 0.3470 21.9887 7.0450 2.3196 7.5816 13.8954 10.5433 2.7281 17.3503 0.6412 5.9843 2.3668 0.3907 1.1393 3.9586 45.5000 81.9770 78.4477 17.9124 22.1109 39.6975 49.8983 28.1916 0.9972 14.3163 7.8826 5.7864 7.0860 1.9612 15.4734 5.3772 34.2229 39.6655 53.1577 34.2693 105.5050 1.2937 9.2685
temp: 298.150 k
press: 1.00000 atm
elementType: 8 8 7 6 6 6 6 6 6 6 6 6 6 6 6 6 6 6 6 6 6 6 6 6 6 6 1 1 1 1 1 1 1 1 1 1 1 1 1 1 1 1 1 1 1 1 1 1 1
symmnumber: 1
zpe: 1050496.3 jmol-1
zpe.correction: 0.400113 hartree
zpe.thermalcorrener: 0.423082 hartree
zpe.thermalcorrenthalpy: 0.424026 hartree
zpe.thermalcorrgfe: 0.344826 hartree
zpe.sumelectzpe: -1093.589291 hartree
zpe.sumelectthermal: -1093.566322 hartree
zpe.sumelectthermalent: -1093.565378 hartree
zpe.sumelectthermalfe: -1093.644578 hartree
dipole: -0.2510 3.2322 0.0200
dipole: 3.2420
quadrupole: -125.3402 -156.3628 -159.6971
quadrupole: -16.3192 5.8808 -0.2489
quadrupole: 21.7932 -9.2294 -12.5638 -16.3192 5.8808 -0.2489
hfenergy: -1093.9894037 hartree
pointgroup: C01 [X(C23H23N1O2)]
dipole: -0.3152211 1.235603 0.0279165 debye
polarizability: 433.4732171|-85.7073727|360.7777105|18.3478527|14.2441242|133.4778229 unknown
InChI: InChI=1S/C23H23NO2/c1-23(14-25,15-26)24-13-22-20-9-5-4-8-18(20)11-19-10-16-6-2-3-7-17(16)12-21(19)22/h2-12,24-26H,13-15H2,1H3
charge 0 multiplicity 1
49 atoms
O  -3.421359 -4.441499 -0.67508
O  -5.321829 -2.551687 -0.439792
N  -2.017659 -1.044609 0.441993
C  -3.011912 -2.148267 0.320649
C  -0.403149 0.63778 -0.385706
C  -1.328797 -0.514003 -0.763369
C  1.006509 0.40188 -0.208502
C  -0.935564 1.94641 -0.202734
C  -2.565882 -3.25763 -0.691367
C  -4.333167 -1.484832 -0.154232
C  1.893219 1.533725 0.103582
C  -3.209007 -2.760227 1.724401
C  -0.041283 3.06754 0.09534
C  1.340935 2.836253 0.229928
C  1.599844 -0.894196 -0.300614
C  2.982567 -1.109564 -0.118194
C  3.28956 1.309896 0.27637
C  3.858458 0.025866 0.173855
C  -2.351916 2.226717 -0.291689
C  -0.593528 4.393571 0.246647
C  -2.846582 3.515375 -0.133216
C  3.568996 -2.426517 -0.21177
C  5.271823 -0.212229 0.352501
C  -1.957809 4.618216 0.130972
C  4.933483 -2.615422 -0.032736
C  5.796246 -1.49436 0.25256
H  -2.09258 -0.152848 -1.477319
H  -0.752403 -1.284743 -1.317415
H  -1.370867 -1.186148 1.22639
H  -1.555491 -3.612657 -0.41459
H  -2.518286 -2.827543 -1.717662
H  -4.703695 -0.812608 0.643667
H  -4.149666 -0.895328 -1.077057
H  -2.295958 -3.293889 2.048442
H  -4.035708 -3.487332 1.717854
H  -3.435219 -1.962214 2.4555
H  2.008903 3.679213 0.447947
H  0.973024 -1.766488 -0.51441
H  3.935091 2.168126 0.502834
H  -3.045524 1.39601 -0.446501
H  0.092387 5.222052 0.460639
H  -3.924753 3.700831 -0.197488
H  2.914682 -3.279168 -0.430151
H  5.924973 0.641307 0.57057
H  -2.367759 5.62718 0.248988
H  -4.359234 -4.099262 -0.730572
H  -6.173052 -2.163088 -0.754237
H  5.366077 -3.619084 -0.107585
H  6.869559 -1.665405 0.389962
