program: Gaussian 09
title: 000149296
version: EM64L-G09RevD.01
frameworkgroup: C1[X(C21H20N4O2S)]
method: RPBEPBE
basis: SDD
operation: Freq
keyword: #p
keyword: freq=noraman
keyword: PBEPBE/SDD
title: #p freq=noraman PBEPBE/SDD
converged: YES YES NO NO
title: Mulliken charges:
elementType: S O O N N N N C C C C C C C C C C C C C C C C C C C C C H H H H H H H H H H H H H H H H H H H H
charge: 0.976126 -0.546702 -0.538846 -0.499266 -0.046973 -0.416724 -0.485087 0.213710 0.250303 0.238115 -0.050138 -0.102801 -0.350508 -0.564712 0.451540 -0.391268 0.484613 -0.398332 -0.316014 -0.447444 -0.320361 -0.263900 0.261380 -0.233545 -0.285995 -0.365094 -0.634371 -0.765778 0.309066 0.264803 0.256094 0.225937 0.242311 0.264388 0.234363 0.273796 0.228804 0.231644 0.286750 0.228069 0.306734 0.267349 0.233619 0.232993 0.227332 0.261094 0.295324 0.277599
chargesum: 0.00000
title: Mulliken charges with hydrogens summed into heavy atoms:
elementType: S O O N N N N C C C C C C C C C C C C C C C C C C C C C
charge: 0.976126 -0.546702 -0.538846 -0.190200 -0.046973 -0.109990 -0.217738 0.213710 0.250303 0.238115 -0.050138 -0.102801 -0.085705 -0.308617 0.451540 -0.165332 0.484613 -0.156020 -0.051626 -0.213081 -0.046565 -0.035095 0.261380 -0.001901 0.000755 -0.137024 0.059573 0.068240
polarizability: 5.56769952e+02 8.03478411e+00 4.38094028e+02 6.66158354e+00 -2.65061847e+00 1.96657374e+02
1716.lowfreq: -4.1029 -0.0011 -0.0009 0.0019 4.0287 4.6738 15.4626 18.8959 25.8635
frequency: 15.3752 18.8867 25.8564 38.3731 46.9984 56.9431 75.1626 99.3097 101.8799 115.3360 124.1098 141.6592 145.2185 146.9527 167.1509 184.4280 186.3564 214.0053 233.9985 251.4654 275.9387 295.9216 300.8483 315.6928 321.6145 328.7219 365.0805 393.3129 398.8060 407.0233 419.9025 423.1143 433.4188 467.0575 481.6861 498.8017 513.1958 524.6364 535.1758 546.1853 553.0853 588.5666 596.6651 629.9402 642.4123 643.3859 663.5210 708.7705 727.5105 737.4570 748.6622 763.2995 775.6966 789.6279 808.2563 811.0319 820.0559 829.1232 832.1561 854.6980 859.9512 866.2512 871.6811 890.0879 915.7152 943.9156 944.7813 949.9951 958.2512 961.5365 964.9194 992.1582 994.0454 1003.5380 1019.1695 1059.0532 1081.9732 1116.9994 1118.3689 1122.0028 1150.5883 1162.5608 1181.0276 1186.5971 1189.0806 1213.4592 1230.5889 1246.0118 1263.4419 1276.8827 1279.1292 1289.6558 1317.5984 1332.5977 1348.4189 1366.0079 1378.5618 1391.8416 1404.4750 1408.8276 1414.9106 1436.5078 1438.7257 1443.8438 1461.7965 1470.7162 1474.8474 1485.3115 1496.7310 1500.6066 1506.7987 1531.3874 1549.9392 1560.5274 1574.3827 1612.6104 1615.4514 1646.3897 2952.2149 3018.7656 3029.3626 3097.0903 3117.1168 3120.9593 3123.5825 3136.2199 3142.3746 3147.8259 3155.2300 3168.6002 3170.3252 3170.6292 3178.5911 3179.7193 3183.4997 3338.7927 3519.3223 3583.6274
redmass: 6.1788 5.8761 5.1610 5.3058 5.7070 4.1752 3.9022 4.9523 3.5052 3.4224 5.8666 1.7929 1.9403 4.1450 1.5095 5.9652 2.5129 4.4992 4.3174 4.3197 4.6526 5.0159 4.1137 6.0568 5.6327 5.2264 7.0864 3.1953 4.6151 2.2082 2.8931 3.0830 2.1740 2.4701 1.7384 5.4970 3.8967 2.9806 4.9019 3.9387 5.2895 6.3389 4.9794 6.2079 6.0404 3.6318 5.7388 5.0009 3.9823 3.1963 5.0755 1.8229 2.9997 2.3570 5.4522 1.4531 2.0040 4.5223 1.7086 1.4195 4.6163 1.7455 1.8312 2.1439 5.0711 3.4563 1.3857 1.3467 1.3571 1.3413 1.3569 1.3262 2.7672 2.2853 2.1202 2.5910 3.0069 1.5873 1.6826 1.2777 1.5978 1.2442 1.2392 1.3621 1.1738 1.9250 1.7293 2.5655 1.7908 1.7885 1.1676 4.2641 1.8339 1.8207 2.2558 3.0606 3.7463 3.6496 2.6656 1.0590 1.0574 3.5200 3.6192 1.6044 2.1265 1.0421 2.3339 2.6974 2.8057 1.2683 2.7103 4.3655 4.4943 6.5466 3.8321 5.9689 6.1330 6.4982 1.0376 1.1013 1.0239 1.0961 1.0898 1.0861 1.0904 1.0888 1.0914 1.0861 1.0948 1.0945 1.0992 1.0964 1.0953 1.1072 1.1079 1.0751 1.0748 1.0772
irintensity: 3.0256 4.4721 1.2163 0.4386 0.5730 4.7737 3.5126 13.5024 0.7625 2.5984 34.4966 3.4841 17.0892 30.8489 9.5365 36.7798 1.1116 0.8742 5.8258 1.8363 13.6176 5.1243 4.0168 13.4694 11.1354 12.6827 13.4036 49.2923 11.7653 42.0305 6.9721 26.8879 17.2927 61.0421 194.8118 14.9500 26.8129 18.0000 20.6819 15.3208 13.5184 4.4237 36.2483 4.1038 4.5891 6.5247 3.7129 12.0271 6.5856 1.2237 7.6235 50.7462 20.7656 0.5750 97.0422 40.9855 25.6939 3.9743 87.4837 69.2727 10.4649 34.6673 6.0552 13.5938 1.7494 19.3424 127.8160 15.2863 0.7699 0.1269 2.0911 0.3975 0.5831 42.0182 9.4766 2.0447 14.2295 15.0710 5.8623 2.4071 0.9211 10.8333 59.0385 17.1780 5.0020 54.7028 13.2784 12.9209 34.9024 56.0315 2.4753 12.3794 42.3891 67.0656 86.7290 29.7512 150.9187 20.3405 82.9420 5.7216 13.0554 66.7055 158.9610 56.7456 48.0621 12.9158 200.1904 21.5650 237.8098 77.4467 265.1112 23.2097 54.5960 14.8724 20.0426 328.0386 322.5412 398.4274 135.5168 45.2937 0.8240 29.4913 11.6735 4.7279 11.8962 14.7774 14.0884 2.6713 23.7603 12.8433 41.9403 3.7154 1.0069 0.1614 1.3227 12.2929 43.8903 77.4839
temp: 298.150 k
press: 1.00000 atm
elementType: 16 8 8 7 7 7 7 6 6 6 6 6 6 6 6 6 6 6 6 6 6 6 6 6 6 6 6 6 1 1 1 1 1 1 1 1 1 1 1 1 1 1 1 1 1 1 1 1
symmnumber: 1
zpe: 963990.4 jmol-1
zpe.correction: 0.367165 hartree
zpe.thermalcorrener: 0.393588 hartree
zpe.thermalcorrenthalpy: 0.394532 hartree
zpe.thermalcorrgfe: 0.308173 hartree
zpe.sumelectzpe: -1577.617866 hartree
zpe.sumelectthermal: -1577.591443 hartree
zpe.sumelectthermalent: -1577.590499 hartree
zpe.sumelectthermalfe: -1577.676858 hartree
dipole: -7.3260 1.3861 -1.8469
dipole: 7.6813
quadrupole: -231.7292 -137.7999 -166.2234
quadrupole: -28.8107 -11.3291 -3.9201
quadrupole: -53.1450 40.7843 12.3607 -28.8107 -11.3291 -3.9201
hfenergy: -1577.985031 hartree
pointgroup: C01 [X(C21H20N4O2S1)]
dipole: 2.9293877 -0.0254452 0.742269 debye
polarizability: 550.8046614|-27.8229646|440.4266008|5.5086801|29.4854828|200.2900914 unknown
InChI: InChI=1S/C21H20N4O2S/c1-22-16-11-12-18-20(13-16)24-19-6-4-3-5-17(19)21(18)23-14-7-9-15(10-8-14)25-28(2,26)27/h3-13,22-23,25H,1-2H3
charge 0 multiplicity 1
48 atoms
S  -6.251523 1.241835 0.594616
O  -7.311915 2.228407 1.339009
O  -6.605914 0.511009 -0.815183
N  -0.058397 -0.766236 -1.289704
N  3.738552 -1.50419 0.618553
N  4.698317 3.221582 0.951111
N  -4.547339 2.348424 0.244481
C  1.184095 -0.980589 -0.626781
C  2.03999 0.099813 -0.263298
C  1.610453 -2.327488 -0.388394
C  3.310348 -0.215398 0.39666
C  2.923363 -2.528868 0.219313
C  1.758641 1.480398 -0.550463
C  4.171721 0.847585 0.800569
C  -1.145803 0.01446 -0.860661
C  0.805473 -3.478445 -0.696277
C  3.850871 2.194685 0.547715
C  2.623298 2.49377 -0.162389
C  3.384892 -3.876622 0.431672
C  -2.247878 0.202765 -1.750979
C  -1.204691 0.596433 0.440718
C  1.284105 -4.767923 -0.469982
C  -3.420952 1.555854 -0.069871
C  2.592554 -4.967949 0.088283
C  -3.359937 0.962821 -1.369063
C  -2.334718 1.330553 0.830953
C  4.461827 4.643568 0.704084
C  -5.8070 -0.182359 1.827939
H  -0.241065 -1.372662 -2.092679
H  0.846205 1.739478 -1.094983
H  5.105682 0.565835 1.298831
H  -0.210597 -3.342466 -1.084489
H  2.377702 3.531663 -0.407077
H  4.377289 -3.996117 0.877017
H  -2.211753 -0.237221 -2.755267
H  -0.378877 0.448358 1.141804
H  0.657422 -5.635179 -0.704559
H  2.95688 -5.987532 0.256034
H  -4.195812 1.125269 -2.055632
H  -2.376368 1.754162 1.843145
H  5.555319 2.955461 1.433157
H  -4.456321 2.852461 1.150631
H  3.518328 4.993808 1.16784
H  4.423084 4.88023 -0.378328
H  5.287522 5.225364 1.145225
H  -5.606862 0.291651 2.798502
H  -6.699513 -0.823012 1.850698
H  -4.932599 -0.700547 1.411099
