program: Gaussian 09
title: 000149273
version: EM64L-G09RevD.01
frameworkgroup: C1[X(C22H30N3)]
method: RPBEPBE
basis: SDD
operation: Freq
keyword: #p
keyword: freq=noraman
keyword: PBEPBE/SDD
title: #p freq=noraman PBEPBE/SDD
converged: YES YES NO NO
title: Mulliken charges:
elementType: N N N C C C C C C C C C C C C C C C C C C C C C C H H H H H H H H H H H H H H H H H H H H H H H H H H H H H H
charge: -0.198741 -0.694527 -0.686190 0.191064 -0.618314 -0.377718 0.296205 -0.366833 0.259053 0.344756 0.255630 -0.376631 -0.414842 -0.355085 -0.625795 -0.578528 -0.366484 -0.353062 -0.355733 0.544932 -0.654833 0.546311 -0.458143 -0.475505 -0.689238 0.260454 0.261076 0.238074 0.209108 0.200780 0.200084 0.196495 0.197106 0.253362 0.266157 0.192455 0.192893 0.233370 0.246701 0.235900 0.233045 0.197169 0.197546 0.234162 0.248247 0.249266 0.245566 0.246743 0.211763 0.211128 0.225438 0.326359 0.333622 0.336665 0.327516
chargesum: 1.00000
title: Mulliken charges with hydrogens summed into heavy atoms:
elementType: N N N C C C C C C C C C C C C C C C C C C C C C C
charge: -0.198741 -0.034546 -0.022010 0.191064 -0.096784 0.069465 0.296205 0.034031 0.259053 0.344756 0.255630 0.016970 0.104677 0.030263 -0.392425 -0.331827 -0.130584 -0.120017 0.038983 0.544932 0.076841 0.546311 -0.212577 -0.228762 -0.040908
polarizability: 3.85473143e+02 6.04762199e+01 3.61680660e+02 4.57201991e+01 8.99896461e-01 1.61087998e+02
1716.lowfreq: -10.9570 -0.0005 0.0003 0.0012 1.9567 6.8121 17.2360 25.2892 43.5019
frequency: 16.8873 24.5633 43.4679 51.4490 59.1764 66.1015 87.5108 95.3007 110.0945 121.4567 130.0520 134.2543 156.1353 168.5848 180.2271 195.2339 209.1640 230.6428 245.4917 258.9390 289.2568 305.5483 315.8706 362.8904 372.0614 389.6511 396.2304 407.4430 418.3909 431.7197 442.9750 450.4757 465.3739 480.0044 494.9946 503.7436 510.6449 519.1477 521.7607 576.6904 580.7212 620.5641 649.3816 682.5086 692.4296 708.3262 722.2073 723.8253 730.0428 735.9966 765.6965 771.5977 806.2135 827.5659 829.5639 838.2319 844.8076 856.4732 860.8482 891.6367 909.3666 942.3532 960.7785 963.6807 974.2778 977.1160 984.0577 994.0228 1012.6345 1019.4526 1033.9666 1054.9970 1061.6840 1069.2209 1078.3473 1080.4388 1092.7190 1099.3472 1115.1700 1134.2478 1154.6344 1181.2083 1187.1040 1212.0712 1221.6751 1225.9584 1250.5140 1263.7997 1266.9010 1268.8249 1282.3424 1288.9840 1293.1575 1295.9585 1303.3509 1323.3182 1329.4797 1338.8333 1344.3296 1350.0893 1356.0797 1356.7805 1378.9822 1393.6465 1397.2923 1401.9588 1411.4091 1444.6427 1462.6668 1463.6639 1467.4275 1469.9612 1474.3959 1475.9671 1477.3944 1479.2140 1483.5539 1486.3393 1489.0528 1496.6208 1514.3663 1543.4332 1550.0924 1558.8636 1573.1637 1641.6042 1646.7924 1657.4447 1658.9015 2955.0635 2956.1997 2962.4968 2970.7872 2975.5654 2977.2479 2990.6469 3000.6912 3000.8442 3016.3624 3032.5544 3034.8124 3044.8769 3064.5749 3072.8522 3078.9228 3082.3543 3095.4781 3102.7809 3127.8834 3138.2309 3144.6200 3164.2715 3172.6590 3182.5742 3184.9297 3552.7885 3556.0741 3688.3335 3691.5006
redmass: 4.4098 4.2017 1.9761 2.8341 3.0672 3.3336 3.7708 3.5109 1.7678 2.6910 2.5434 3.9748 2.1880 3.9455 4.0037 1.0637 3.4502 1.1405 3.4894 4.4846 2.9728 3.4862 5.4433 3.3882 4.3638 3.5283 3.1441 1.1085 1.0627 3.0529 2.7738 3.2499 2.6511 2.9230 1.3629 1.6840 1.8469 3.7617 6.0266 3.3231 3.2404 4.0386 4.1535 5.5204 5.2405 4.4237 1.3535 1.7050 1.4949 1.8837 1.2473 2.2423 1.2011 1.4143 1.3583 1.7931 2.0425 2.1524 3.7273 1.8925 1.3277 2.5339 2.2876 1.4149 3.8917 1.3779 6.7814 1.4537 1.8162 3.2978 3.4252 1.7250 1.4977 2.6689 2.6746 2.3048 2.2701 1.5882 2.4207 1.8522 1.7389 1.2267 1.7207 2.1229 1.2715 1.3982 1.3366 1.2879 1.2656 1.3510 1.0535 1.5100 1.1265 1.1091 1.3262 1.9067 1.3768 1.4064 2.7276 1.5327 1.6367 2.4931 2.9420 1.2134 3.7895 1.2665 2.9666 5.5126 1.0703 1.0811 1.1656 1.0765 1.7235 2.5165 1.7457 1.0716 1.1670 1.1137 1.0937 1.3734 2.1147 1.4114 3.4844 3.2392 7.3292 3.1747 2.8776 1.4555 1.4274 1.0590 1.0591 1.0594 1.0597 1.0609 1.0362 1.0972 1.0954 1.0403 1.1021 1.0988 1.0650 1.1039 1.0674 1.1007 1.0993 1.1014 1.0974 1.1000 1.1000 1.0898 1.0900 1.0902 1.0964 1.0909 1.0917 1.0460 1.0460 1.1039 1.1039
irintensity: 0.2472 0.1689 0.1348 1.3057 1.0252 0.3268 2.3583 0.0939 0.1307 0.2212 0.3494 2.1392 0.1296 0.9158 3.4002 0.4068 0.4233 0.0322 2.3400 1.0494 1.2900 1.2554 1.3997 0.0164 3.0132 0.6954 0.0668 5.9640 0.2959 8.2396 26.2964 1.6211 1.6510 2.1147 281.1910 49.3720 223.0446 7.1308 6.7750 0.2929 0.6862 4.7789 1.5072 1.1988 10.8685 1.8925 11.1476 4.5459 0.8110 0.5983 2.1692 1.2442 6.8337 17.1310 14.2845 1.1882 91.3629 14.4871 8.6908 3.0727 3.5046 4.2576 3.6911 0.2169 5.4621 0.3923 6.2681 3.0823 2.8682 7.5177 2.3445 7.0860 0.7678 2.1422 5.0954 1.4041 35.1819 4.8470 42.4689 8.6752 12.4174 11.0223 1.1556 23.2997 20.2154 6.1303 15.3956 4.9486 15.7067 24.0482 6.8764 70.6617 1.3929 1.5145 3.1443 74.6099 4.1824 29.1866 10.9490 2.2393 0.2048 42.6405 19.4645 10.9212 40.6223 29.8823 7.7196 45.4963 0.2839 0.0966 16.6408 1.1145 16.3583 17.0792 10.6018 20.0561 12.1090 31.5959 21.1111 127.1269 293.2944 18.9636 17.8391 13.6284 35.8930 16.0486 128.2107 841.6122 50.7861 0.8591 0.2444 15.3532 62.7117 63.8751 40.9049 0.2708 1.5679 9.2901 0.0934 6.8892 18.2860 90.9987 7.2997 77.3648 44.2383 21.2633 11.7563 14.5174 10.9297 8.2801 5.8802 12.3997 0.9995 16.2050 7.4300 293.8455 129.0780 33.5890 32.6043
temp: 298.150 k
press: 1.00000 atm
elementType: 7 7 7 6 6 6 6 6 6 6 6 6 6 6 6 6 6 6 6 6 6 6 6 6 6 1 1 1 1 1 1 1 1 1 1 1 1 1 1 1 1 1 1 1 1 1 1 1 1 1 1 1 1 1 1
symmnumber: 1
zpe: 1253383.4 jmol-1
zpe.correction: 0.477389 hartree
zpe.thermalcorrener: 0.502744 hartree
zpe.thermalcorrenthalpy: 0.503688 hartree
zpe.thermalcorrgfe: 0.421301 hartree
zpe.sumelectzpe: -1018.583293 hartree
zpe.sumelectthermal: -1018.557938 hartree
zpe.sumelectthermalent: -1018.556994 hartree
zpe.sumelectthermalfe: -1018.639380 hartree
dipole: -6.4570 -0.2215 0.6451
dipole: 6.4929
quadrupole: -78.5243 -78.8357 -150.1625
quadrupole: 20.3963 13.3852 -0.0231
quadrupole: 23.9832 23.6718 -47.6550 20.3963 13.3852 -0.0231
hfenergy: -1019.0606816 hartree
pointgroup: C01 [X(C22H30N3)]
dipole: -2.5344268 -0.1571791 0.2783764 debye
polarizability: 381.9277268|63.536019|365.3597787|40.837044|-9.4075643|160.9542952 unknown
InChI: InChI=1S/C22H30N3/c1-3-5-6-7-8-9-21-20-14-16(23)10-12-18(20)19-13-11-17(24)15-22(19)25(21)4-2/h10-15H,3-9,23-24H2,1-2H3
charge 1 multiplicity 1
55 atoms
N  -0.867714 -1.174244 0.490286
N  0.401084 4.854224 0.192916
N  -5.104401 -3.422589 -0.591081
C  -0.102857 -0.043735 0.653257
C  1.319666 -0.173244 1.15744
C  2.365323 -0.293409 0.00262
C  -0.63785 1.250313 0.305502
C  3.812522 -0.384444 0.53555
C  -2.22454 -1.133111 0.048917
C  -1.994398 1.341741 -0.187665
C  -2.789692 0.142771 -0.303443
C  4.854485 -0.523559 -0.598009
C  -0.277984 -2.525428 0.793647
C  6.308178 -0.607218 -0.079093
C  0.158992 2.432098 0.427431
C  -2.998893 -2.319043 -0.040513
C  -2.490805 2.639036 -0.533694
C  -4.146488 0.152134 -0.763054
C  7.347407 -0.759131 -1.213623
C  -0.352727 3.699158 0.080826
C  -0.587199 -3.001965 2.226107
C  -4.337788 -2.276337 -0.497968
C  -1.706852 3.778684 -0.405411
C  -4.902571 -1.006962 -0.865717
C  8.79772 -0.842321 -0.69173
H  1.563024 0.715603 1.762795
H  1.432548 -1.026997 1.845873
H  2.267698 0.579272 -0.672008
H  2.142981 -1.186449 -0.616296
H  3.90302 -1.250112 1.224287
H  4.043386 0.518144 1.138689
H  4.628448 -1.430392 -1.196622
H  4.763499 0.337956 -1.291849
H  -0.666792 -3.228297 0.040743
H  0.805483 -2.475569 0.622853
H  6.543453 0.302398 0.511876
H  6.402665 -1.465041 0.619016
H  1.189185 2.368491 0.786666
H  -2.594987 -3.288813 0.25434
H  -3.510586 2.75452 -0.908102
H  -4.612257 1.098871 -1.045962
H  7.254023 0.097352 -1.912259
H  7.113005 -1.668549 -1.803579
H  -0.140943 -2.330538 2.980052
H  -0.164802 -4.01065 2.377907
H  -1.671806 -3.049749 2.41846
H  -2.1206 4.75692 -0.676727
H  -5.936693 -0.958954 -1.22399
H  8.930948 -1.711613 -0.020823
H  9.068961 0.066226 -0.121978
H  9.518616 -0.945562 -1.522589
H  1.356366 4.83267 0.540916
H  0.014861 5.758916 -0.06484
H  -6.068862 -3.380379 -0.911607
H  -4.730262 -4.336293 -0.346442
