program: Gaussian 09
title: 000149229
version: EM64L-G09RevD.01
frameworkgroup: C1[X(C9H10O2)]
method: RPBEPBE
basis: SDD
operation: Freq
keyword: #pfreq=noraman
keyword: PBEPBE/SDD
title: #p freq=noraman PBEPBE/SDD
converged: YES YES NO NO
title: Mulliken charges:
elementType: O O C C C C C C C C C H H H H H H H H H H
charge: -0.285619 -0.424189 -0.274113 -0.077525 0.475973 -0.349369 -0.373532 -0.405958 -0.226969 -0.225579 -0.237866 0.224759 0.234521 0.192131 0.236050 0.262782 0.230554 0.228174 0.228123 0.336900 0.230754
chargesum: 0.00000
title: Mulliken charges with hydrogens summed into heavy atoms:
elementType: O O C C C C C C C C C
charge: -0.285619 -0.087290 -0.049354 0.156996 0.475973 0.078811 -0.110750 -0.175404 0.001205 0.002543 -0.007112
polarizability: 1.41274027e+02 2.02788563e+00 9.86707617e+01 -6.92887919e+00 3.23691339e+00 6.00226526e+01
1716.lowfreq: -8.7870 -4.0655 0.0000 0.0002 0.0005 8.9628 43.6992 67.4038 110.8420
frequency: 43.6926 67.3983 110.8417 115.5664 229.7555 246.7648 274.7899 332.3095 403.4330 410.1826 455.1465 549.7889 600.1161 614.0557 703.1471 709.0319 762.3884 812.4538 829.5561 854.6381 919.1733 949.1797 957.6287 977.5620 988.7010 996.8408 1024.7829 1049.4096 1070.7234 1081.3477 1091.1298 1173.1028 1183.8631 1187.2575 1196.1802 1238.7616 1294.1944 1317.5859 1336.2592 1373.5195 1389.6765 1418.6263 1446.8118 1448.3295 1487.2960 1592.8561 1616.2314 2944.3965 3059.1745 3077.1681 3093.3843 3116.5934 3128.1499 3139.7843 3151.0260 3165.7111 3559.1252
redmass: 3.7876 5.5532 3.6333 3.2788 5.2372 1.9452 2.2544 2.5125 2.8547 4.8402 3.2725 3.0055 6.1571 6.4447 1.9896 4.3815 1.8238 4.7619 5.1968 1.2609 1.4387 2.0349 3.1909 1.3951 5.7371 1.3264 2.1854 2.0300 1.4226 1.5250 1.3713 1.0592 1.2142 1.3236 2.3777 1.4584 1.2525 1.3492 1.2759 1.6489 3.2346 2.1602 1.4213 1.4923 2.5056 6.0814 6.0639 1.0690 1.0894 1.0889 1.0935 1.0874 1.0863 1.0913 1.0959 1.1015 1.0664
irintensity: 3.0094 0.6367 12.3269 1.2928 1.8027 55.1446 84.1074 27.8235 0.2755 8.3205 15.3554 29.6209 15.6817 0.0051 45.3990 6.1091 72.8879 14.8629 22.7240 0.4667 7.1541 81.8715 19.6119 0.0738 0.0190 0.2565 4.9170 21.0297 8.1538 6.8155 7.8285 0.2197 6.6188 25.9459 6.8748 0.3592 4.6187 5.3755 10.5475 15.2212 4.2188 7.9380 15.1719 5.1117 12.9042 0.6883 5.6877 56.8800 9.8444 20.6220 24.0323 9.8320 0.1791 15.4061 28.8673 21.7092 11.2889
temp: 298.150 k
press: 1.00000 atm
elementType: 8 8 6 6 6 6 6 6 6 6 6 1 1 1 1 1 1 1 1 1 1
symmnumber: 1
zpe: 438829.7 jmol-1
zpe.correction: 0.167141 hartree
zpe.thermalcorrener: 0.177330 hartree
zpe.thermalcorrenthalpy: 0.178275 hartree
zpe.thermalcorrgfe: 0.130554 hartree
zpe.sumelectzpe: -498.534063 hartree
zpe.sumelectthermal: -498.523874 hartree
zpe.sumelectthermalent: -498.522929 hartree
zpe.sumelectthermalfe: -498.570650 hartree
dipole: 2.1203 1.3586 -3.0428
dipole: 3.9497
quadrupole: -70.2998 -57.3465 -67.4096
quadrupole: -2.1483 6.2186 4.5265
quadrupole: -5.2811 7.6721 -2.3910 -2.1483 6.2186 4.5265
hfenergy: -498.701204 hartree
pointgroup: C01 [X(C9H10O2)]
dipole: -0.7836077 1.1355294 0.7150071 debye
dipolederiv: -0.5563132 -0.0021076 0.0544837 0.1211215 -0.5677701 -0.152284 0.1288278 -0.1292061 -0.3422149 -0.9198413 -0.0327879 -0.261028 0.0061967 -0.5583871 0.1055764 -0.3291686 0.1223324 -0.2474336 0.2731514 -0.001869 -0.0671234 -0.1015134 0.2334831 -0.0465031 -0.2605838 0.0202215 0.2906367 0.0838929 0.0934333 -0.0921624 -0.0123231 0.2148263 0.1071665 0.0710881 0.0297433 0.2411238 0.2647755 -0.0227925 0.0035944 0.0056881 -0.0658474 0.0136522 -0.0386268 0.008537 -0.079531 0.6697876 -0.1294051 0.2130755 -0.0216949 0.4031278 -0.0698253 0.1848529 -0.0611908 0.2963992 -0.1450161 -0.0647157 0.0054335 -0.1197756 -0.0168046 -0.0556793 0.0046027 -0.0291329 -0.1116925 -0.1625268 0.0427996 -0.0614116 0.0396053 -0.0112131 -0.1096339 -0.0064717 -0.1177778 -0.0687176 -0.0197869 0.0366194 -0.0620318 0.058014 0.0337996 -0.1250775 -0.0663347 -0.1232517 -0.0514729 0.0214512 -0.0942019 0.0094342 -0.1122712 0.0222848 -0.0781993 0.0174454 -0.0791122 -0.096545 0.0357008 -0.0170851 -0.0702764 -0.0153731 -0.1023567 -0.0379554 -0.0543119 -0.0407189 -0.1181576 -0.0016594 0.0160434 0.0346957 -0.0055788 0.000879 0.1088748 0.0635567 0.0968593 -0.0304114 0.0447825 -0.0435173 0.0390891 -0.0756722 0.0554502 0.0102279 0.0231941 -0.0094455 -0.1286934 -0.0549624 0.0438684 -0.0511862 0.0199106 -0.1987803 -0.0415171 -0.0378807 -0.0919489 0.0383583 0.0506562 0.0116929 -0.0024602 0.0229769 0.0875794 -0.0014597 0.0177093 0.039463 -0.0929604 0.0669461 0.0890257 -0.0263045 0.0798169 0.0338036 0.058831 -0.0283875 0.0406696 0.1197173 0.0636238 -0.0608925 0.0763086 -0.0458521 0.0103877 0.10765 0.0607065 0.1146609 0.0526896 0.0505042 -0.042051 0.0570781 -0.0545538 -0.0069159 0.1184537 0.073152 0.1143932 0.0619145 -0.002037 0.1030402 -0.0238098 0.1153416 -0.0084076 0.0781467 -0.0275809 0.0787646 0.113196 0.3493411 0.061193 0.1505761 0.0830393 0.330318 -0.0213305 0.1270662 -0.0147155 0.0344478 -0.1124702 0.0137098 0.0740253 0.0128972 0.1105431 0.0308858 0.0771451 0.0308555 0.1193471 unknown
polarizability: 140.665733|-8.0530699|85.0346398|-5.4315306|-18.7102182|74.2670684 unknown
InChI: InChI=1S/C9H10O2/c10-6-8-9(11-8)7-4-2-1-3-5-7/h1-5,8-10H,6H2
charge 0 multiplicity 1
21 atoms
O  1.546844 -1.187909 -0.776787
O  4.380949 -0.156036 0.596434
C  0.798796 0.131002 -0.820684
C  1.930945 -0.0702 0.156153
C  -0.633749 0.125971 -0.394199
C  3.285556 0.575684 -0.053332
C  -1.145071 -0.901692 0.439479
C  -1.497752 1.1656 -0.822582
C  -2.494991 -0.87809 0.84958
C  -2.847464 1.191335 -0.406807
C  -3.349564 0.170892 0.433328
H  1.024791 0.720073 -1.721892
H  1.649676 -0.266692 1.203399
H  3.246094 1.629445 0.303386
H  3.539466 0.569723 -1.125712
H  -0.486214 -1.729169 0.726261
H  -1.114813 1.955592 -1.481054
H  -2.885056 -1.680302 1.485998
H  -3.506351 2.000028 -0.742174
H  4.243372 -0.148771 1.577763
H  -4.397863 0.186515 0.751542
