program: Gaussian 09
title: 000149241
version: EM64L-G09RevD.01
frameworkgroup: C1[X(C20H14N2O2)]
method: RPBEPBE
basis: SDD
operation: Freq
keyword: #p
keyword: freq=noraman
keyword: PBEPBE/SDD
title: #p freq=noraman PBEPBE/SDD
converged: YES YES NO NO
title: Mulliken charges:
elementType: O O N N C C C C C C C C C C C C C C C C C C C C H H H H H H H H H H H H H H
charge: -0.436844 -0.255568 -0.513723 -0.035649 0.236704 0.232417 0.235288 -0.110537 -0.093235 -0.336801 -0.383832 0.458608 -0.308499 -0.307479 -0.264187 -0.260545 -0.237675 -0.233640 -0.586017 -0.338360 0.290930 -0.204662 -0.362719 0.107900 0.311199 0.267778 0.224318 0.266338 0.266916 0.232274 0.230538 0.233437 0.233971 0.272474 0.274731 0.233426 0.276096 0.384632
chargesum: 0.00000
title: Mulliken charges with hydrogens summed into heavy atoms:
elementType: O O N N C C C C C C C C C C C C C C C C C C C C
charge: -0.052212 -0.255568 -0.202523 -0.035649 0.236704 0.232417 0.235288 -0.110537 -0.093235 -0.069023 -0.159514 0.458608 -0.042161 -0.040563 -0.031913 -0.030007 -0.004238 0.000331 -0.313543 -0.063630 0.290930 0.028764 -0.086624 0.107900
polarizability: 3.74838702e+02 -1.79058570e+01 3.09671314e+02 9.79011530e+00 9.62362157e+00 1.34534445e+02
1716.lowfreq: -6.0484 0.0003 0.0004 0.0005 1.7927 4.2501 23.7684 34.4738 46.3230
frequency: 23.7377 34.4727 46.2827 65.2572 86.3193 115.7299 127.5929 152.4959 163.5424 202.9935 227.2374 241.7974 275.0302 303.5808 323.1297 379.4906 395.9628 401.6944 421.9759 435.2727 475.3407 482.6210 490.8691 504.8500 523.3399 529.9909 575.0709 583.7584 592.4417 597.4440 608.8907 620.4553 641.0784 658.0383 684.4581 697.9782 729.1309 733.6653 747.3250 771.9757 773.6653 800.3826 812.3361 831.6581 865.8068 872.1281 877.6737 895.1769 909.6500 926.4971 930.4034 964.1032 968.9902 984.0093 990.7809 995.0840 995.5497 1019.3461 1022.7308 1039.7394 1088.3855 1097.2586 1110.3435 1138.1359 1152.7979 1161.5922 1183.6911 1185.6617 1224.5594 1249.5808 1256.4306 1283.0338 1287.2471 1310.8477 1329.4201 1353.2400 1371.3544 1380.9325 1397.0044 1424.2368 1430.3541 1442.5343 1454.1381 1476.2429 1481.7590 1501.3440 1525.4658 1550.3610 1555.4206 1592.2728 1611.2723 1617.2160 1631.0596 1640.3723 3124.2970 3133.2988 3135.7951 3139.1898 3143.5985 3148.5285 3156.2635 3166.6473 3168.4640 3171.8807 3174.7386 3188.2012 3527.2616 3529.7646
redmass: 6.5638 5.9395 5.7014 7.2965 5.0697 3.8585 7.2074 5.1413 5.2605 4.3640 5.1247 4.8796 4.7184 5.3317 4.9014 7.6648 6.3005 3.7227 3.1477 4.6803 2.7850 1.9373 4.2726 3.2990 2.7993 3.6009 5.9830 3.9893 5.0017 4.8334 1.8066 3.1712 6.1208 5.2539 2.7318 4.5503 3.4323 3.7275 3.4251 1.3994 1.6281 2.8824 1.5740 6.0938 4.2333 1.5947 2.0779 4.5055 1.5680 1.5726 4.4550 1.3583 1.3532 6.1515 1.3410 1.3261 1.3251 2.2957 2.0434 3.1869 2.2736 2.0600 2.0291 1.4850 1.3679 1.1888 1.1923 1.1153 1.4285 2.7517 1.8890 2.5770 2.1740 1.6293 3.1203 2.3762 2.5758 4.0997 3.0902 3.5086 6.2942 2.6550 3.1389 2.8900 2.9329 2.5926 6.4825 7.3244 4.2393 5.2153 5.7965 6.2423 6.3962 8.5594 1.0857 1.0859 1.0918 1.0891 1.0878 1.0896 1.0949 1.0951 1.0943 1.0997 1.0993 1.0963 1.0749 1.0641
irintensity: 0.4175 1.0498 0.9707 1.0319 1.9474 0.1056 2.1530 1.3322 3.7758 0.5151 2.0123 2.5152 6.3221 1.5610 8.1415 10.2437 5.2432 5.0642 7.3054 11.2422 15.2886 65.3152 56.0442 1.4264 32.0766 26.5206 34.0126 15.7790 12.6667 31.7078 129.2477 4.6926 2.5046 14.0315 4.7591 11.5411 69.6678 28.7681 4.0662 14.2438 127.3274 9.7015 21.8627 5.1937 4.9814 1.3762 6.7901 38.2013 6.9968 10.6224 13.6274 1.4607 2.9482 14.1897 0.4929 0.2310 0.7235 3.4852 12.0573 318.6818 3.2151 12.2351 0.8269 71.8883 47.0635 1.6820 0.7459 3.8293 0.7593 9.0957 3.2195 4.8044 1.1945 3.3170 182.7669 72.8738 92.2991 16.3824 11.8348 38.7497 81.1031 19.3454 2.7137 159.8250 144.9037 206.0471 42.5895 69.9907 37.5222 46.5624 6.4973 95.3211 8.5305 263.0926 1.4338 5.2678 6.6759 12.3670 11.5865 10.4144 21.3638 18.8374 1.7915 33.5059 22.0564 2.9421 18.5242 53.7395
temp: 298.150 k
press: 1.00000 atm
elementType: 8 8 7 7 6 6 6 6 6 6 6 6 6 6 6 6 6 6 6 6 6 6 6 6 1 1 1 1 1 1 1 1 1 1 1 1 1 1
symmnumber: 1
zpe: 756946.2 jmol-1
zpe.correction: 0.288306 hartree
zpe.thermalcorrener: 0.306890 hartree
zpe.thermalcorrenthalpy: 0.307835 hartree
zpe.thermalcorrgfe: 0.240394 hartree
zpe.sumelectzpe: -1028.886015 hartree
zpe.sumelectthermal: -1028.867431 hartree
zpe.sumelectthermalent: -1028.866486 hartree
zpe.sumelectthermalfe: -1028.933927 hartree
dipole: -1.0925 -0.0696 0.8584
dipole: 1.3912
quadrupole: -135.9242 -121.6928 -142.8597
quadrupole: -8.0837 -4.3820 -0.1386
quadrupole: -2.4320 11.7994 -9.3674 -8.0837 -4.3820 -0.1386
hfenergy: -1029.174321 hartree
pointgroup: C01 [X(C20H14N2O2)]
dipole: -0.4338131 -0.0584893 0.3285503 debye
polarizability: 371.6122203|-24.6040598|303.1250924|8.1905268|41.0374617|144.3071487 unknown
InChI: InChI=1S/C20H14N2O2/c23-20(24)13-6-5-7-14(12-13)21-19-15-8-1-3-10-17(15)22-18-11-4-2-9-16(18)19/h1-12,21,23H
charge 0 multiplicity 1
38 atoms
O  -6.410882 0.179118 0.168446
O  -5.43032 -0.727632 -1.729161
N  -0.395266 -0.522257 -0.667213
N  3.774355 0.151329 0.191743
C  0.961059 -0.273605 -0.344942
C  1.462177 1.048434 -0.111347
C  1.877291 -1.376721 -0.333337
C  2.885138 1.194892 0.189035
C  3.288899 -1.09967 -0.086464
C  0.658923 2.237761 -0.217934
C  1.470643 -2.742906 -0.531344
C  -1.555282 -0.112239 0.033441
C  3.408296 2.50962 0.457247
C  4.227591 -2.190482 -0.112548
C  1.206981 3.494569 0.024448
C  2.407254 -3.774513 -0.543102
C  2.591103 3.632551 0.385503
C  3.802174 -3.494477 -0.345631
C  -2.819623 -0.317878 -0.573913
C  -1.501596 0.451448 1.340642
C  -4.007874 0.033924 0.108301
C  -2.692845 0.80851 2.00547
C  -3.953689 0.60724 1.404612
C  -5.297668 -0.217826 -0.588914
H  -0.554596 -1.223368 -1.393634
H  -0.392254 2.152656 -0.505692
H  0.407484 -2.98607 -0.640249
H  4.47325 2.577916 0.699162
H  5.278988 -1.94358 0.063296
H  0.581303 4.388763 -0.069664
H  2.079019 -4.809496 -0.688001
H  3.002013 4.628367 0.584491
H  4.5259 -4.316587 -0.362874
H  -2.902666 -0.746203 -1.579998
H  -0.53589 0.596571 1.83319
H  -2.631632 1.23963 3.010391
H  -4.880165 0.877126 1.916581
H  -7.235196 -0.016513 -0.352737
