program: Gaussian 09
title: 000149237
version: EM64L-G09RevD.01
frameworkgroup: C1[X(C20H13N3O4)]
method: RPBEPBE
basis: SDD
operation: Freq
keyword: #p
keyword: freq=noraman
keyword: PBEPBE/SDD
title: #p freq=noraman PBEPBE/SDD
converged: NO YES NO NO
title: Mulliken charges:
elementType: O O O O N N N C C C C C C C C C C C C C C C C C C C C H H H H H H H H H H H H H
charge: -0.202323 -0.196983 -0.447260 -0.262753 -0.508943 -0.008352 0.024779 0.152186 0.292688 0.277660 -0.054539 -0.105113 -0.363093 -0.372592 -0.471224 0.484057 -0.300703 0.403728 -0.398952 -0.242587 -0.226189 -0.444167 -0.348898 -0.334553 -0.328114 0.258269 0.100748 0.310296 0.271659 0.265666 0.321086 0.273623 0.290136 0.238154 0.241896 0.231047 0.252556 0.271400 0.273329 0.382372
chargesum: 0.00000
title: Mulliken charges with hydrogens summed into heavy atoms:
elementType: O O O O N N N C C C C C C C C C C C C C C C C C C C C
charge: -0.202323 -0.196983 -0.064888 -0.262753 -0.198647 -0.008352 0.024779 0.152186 0.292688 0.277660 -0.054539 -0.105113 -0.091433 -0.106926 -0.150138 0.484057 -0.027080 0.403728 -0.108816 -0.004433 0.015707 -0.213120 -0.096343 -0.063152 -0.054784 0.258269 0.100748
polarizability: 3.65404342e+02 -2.48233335e+01 3.50621157e+02 -2.17053332e+01 -1.77855432e+01 1.72693454e+02
1716.lowfreq: -37.8660 -4.7154 -3.5846 -0.0005 0.0005 0.0005 4.9250 26.5453 34.7307
frequency: -37.8344 26.5357 34.6919 47.8156 64.2834 70.3163 84.2215 95.2398 125.7955 132.7866 163.9206 190.7773 234.3880 239.9919 247.4768 276.9482 293.4113 304.8601 319.1393 356.7387 382.1729 413.7790 413.9328 432.1851 476.4663 479.3234 481.0202 502.6332 513.5871 517.3436 544.5774 574.4055 578.3224 582.1654 585.3611 622.1233 631.2159 648.7268 678.0494 683.3759 705.7807 709.3137 731.0701 748.3132 754.2561 765.1156 782.0509 800.7993 828.4490 830.0494 847.3845 855.7246 858.9089 889.2363 893.2853 944.1740 948.6097 978.9107 979.9514 987.0572 992.0427 1000.9388 1004.7117 1012.8105 1016.0378 1059.3512 1078.1318 1116.5840 1124.7927 1151.4242 1154.1001 1172.7328 1195.9536 1203.4412 1216.9979 1244.2853 1259.1209 1272.4028 1293.0547 1309.3983 1323.8694 1344.5111 1345.9664 1368.5469 1373.5304 1388.2218 1428.1062 1433.3642 1437.9455 1452.7611 1464.5419 1480.6476 1512.6352 1528.0834 1544.5068 1558.6502 1578.3407 1606.0466 1626.1086 1632.9546 1640.2443 3120.2016 3139.1247 3149.0819 3151.3052 3160.2012 3161.2009 3165.7473 3177.0181 3177.4796 3190.3986 3191.9259 3535.3293 3536.1187
redmass: 4.8195 6.9162 7.4044 11.5991 7.1847 5.9084 6.8558 5.3280 4.4667 7.6065 7.0076 5.5200 3.1142 6.1137 2.8791 3.4018 6.1053 5.1145 6.2526 3.6769 6.2865 3.8966 2.9591 6.1361 4.7059 4.3056 4.4431 3.2197 3.8577 6.5470 5.5556 5.2470 3.5171 1.4887 4.8057 6.9770 6.9487 5.9359 7.7748 3.6174 5.2961 5.9027 4.7102 3.4657 4.6300 8.9271 1.5159 3.1066 2.4933 1.4133 1.7452 5.7300 1.9725 1.7923 5.5361 5.3678 1.5206 1.3588 1.3485 1.3535 4.2632 1.3149 1.3374 2.1548 2.9019 2.4504 3.4989 1.7671 1.3324 1.5650 1.3305 1.1798 1.1980 3.8892 1.9380 4.2004 1.5964 1.6351 5.6495 1.5692 3.1743 2.6985 2.0829 4.0739 9.2388 3.4657 5.6610 4.0163 4.1154 3.6622 2.1530 3.4890 3.3348 8.0153 7.9180 8.8360 5.5431 6.4689 6.5535 6.8201 8.2518 1.0895 1.0860 1.0890 1.0892 1.0892 1.0950 1.0961 1.1001 1.0959 1.0940 1.0948 1.0655 1.0743
irintensity: 2.4129 0.3356 1.0609 0.0841 0.1546 2.9073 0.7255 2.5981 0.2704 0.1053 3.8514 3.5711 7.8079 0.8263 12.3947 5.0448 3.5677 7.2953 1.0912 38.7309 5.3836 21.5501 0.4407 2.2361 6.3415 5.8316 22.8138 10.2458 0.9701 1.4783 16.9148 23.5982 21.6566 66.0744 1.1556 9.5995 3.2446 12.8721 10.8822 51.9222 25.9686 1.4260 2.9168 3.1129 22.9244 44.9034 81.7386 1.5185 6.7950 5.5752 47.3486 1.1708 27.4182 0.1696 0.4138 1.9813 23.4649 2.0788 2.1799 0.2314 128.2842 2.7879 0.3453 15.5131 214.8600 40.7664 6.7769 0.1060 11.3885 209.7161 8.3502 5.7085 6.1180 330.3302 104.1928 34.5195 15.7693 20.6623 12.4477 34.1531 191.6140 12.6938 1.8984 155.7223 43.5913 9.1078 118.7478 7.2489 6.9262 3.5225 106.2590 46.5604 267.3001 18.2871 2.4769 27.6208 3.8818 16.6108 573.0300 30.3571 223.4446 12.9041 2.0189 13.2473 4.6327 5.7837 4.3629 13.9490 24.6575 2.7728 2.3402 9.0893 87.3891 19.7396
temp: 298.150 k
press: 1.00000 atm
elementType: 8 8 8 8 7 7 7 6 6 6 6 6 6 6 6 6 6 6 6 6 6 6 6 6 6 6 6 1 1 1 1 1 1 1 1 1 1 1 1 1
symmnumber: 1
zpe: 757783.9 jmol-1
zpe.correction: 0.288625 hartree
zpe.thermalcorrener: 0.309355 hartree
zpe.thermalcorrenthalpy: 0.310299 hartree
zpe.thermalcorrgfe: 0.237933 hartree
zpe.sumelectzpe: -1233.187243 hartree
zpe.sumelectthermal: -1233.166512 hartree
zpe.sumelectthermalent: -1233.165568 hartree
zpe.sumelectthermalfe: -1233.237934 hartree
dipole: -2.1389 5.7193 2.0291
dipole: 6.4345
quadrupole: -205.0020 -151.3155 -142.6054
quadrupole: 11.2589 8.6529 -0.1223
quadrupole: -38.6944 14.9921 23.7023 11.2589 8.6529 -0.1223
hfenergy: -1233.4758676 hartree
pointgroup: C01 [X(C20H13N3O4)]
dipole: -0.7877794 -2.2646984 -0.8118481 debye
polarizability: 364.2448702|24.9926739|352.0413519|22.0780451|-16.1433327|172.4327309 unknown
InChI: InChI=1S/C20H13N3O4/c24-20(25)12-5-7-13(8-6-12)21-19-15-3-1-2-4-17(15)22-18-11-14(23(26)27)9-10-16(18)19/h1-11,21,24H
charge 0 multiplicity 1
40 atoms
O  4.393378 4.19758 -0.08067
O  5.634874 2.579832 0.942664
O  -5.674496 1.531353 2.159486
O  -6.705764 1.705869 0.084621
N  -0.759946 -0.452157 -1.494468
N  2.837125 -1.560275 0.629511
N  4.578321 2.983861 0.322804
C  0.422946 -0.81404 -0.762642
C  1.429147 0.158531 -0.50231
C  0.609821 -2.153655 -0.314864
C  2.634235 -0.27438 0.202667
C  1.853865 -2.480733 0.384533
C  1.310442 1.536302 -0.902501
C  -0.364843 -3.190459 -0.520644
C  3.670925 0.683139 0.466452
C  -1.952016 0.004203 -0.912038
C  2.065711 -3.830699 0.83709
C  3.500465 1.997395 0.049521
C  2.321975 2.447619 -0.635947
C  -0.124503 -4.48303 -0.064332
C  1.100844 -4.807688 0.617702
C  -3.065089 0.314608 -1.751008
C  -2.078426 0.166017 0.49899
C  -4.265536 0.771088 -1.191424
C  -3.286199 0.624885 1.048419
C  -4.394385 0.932853 0.21544
C  -5.680893 1.416868 0.754677
H  -0.738596 -0.558266 -2.510342
H  0.398707 1.85504 -1.415879
H  -1.29969 -2.939926 -1.031253
H  4.574033 0.361529 0.990158
H  3.005887 -4.043753 1.354088
H  2.25119 3.498128 -0.927328
H  -0.874278 -5.266115 -0.219886
H  1.266233 -5.832824 0.965497
H  -2.976867 0.194614 -2.837915
H  -1.23365 -0.068977 1.153774
H  -5.124846 1.011652 -1.826065
H  -3.385989 0.750477 2.130221
H  -6.566911 1.860434 2.449101
