program: Gaussian 09
title: 000149221
version: EM64L-G09RevD.01
frameworkgroup: C1[X(C9H11NO4S)]
method: RPBEPBE
basis: SDD
operation: Freq
keyword: #p
keyword: freq=noraman
keyword: PBEPBE/SDD
title: #p freq=noraman PBEPBE/SDD
converged: NO NO NO NO
title: Mulliken charges:
elementType: S O O O O N C C C C C C C C C H H H H H H H H H H H
charge: 0.982346 -0.395215 -0.510425 -0.514547 -0.244042 -0.445017 -0.076173 0.510219 -0.224593 -0.209210 -0.319824 -0.421597 0.223319 -0.483499 -0.796221 0.281997 0.284503 0.321724 0.233643 0.316196 0.243454 0.245340 0.241427 0.242273 0.274280 0.239642
chargesum: 0.00000
title: Mulliken charges with hydrogens summed into heavy atoms:
elementType: S O O O O N C C C C C C C C C
charge: 0.982346 -0.395215 -0.510425 -0.514547 -0.244042 -0.128821 -0.076173 0.510219 0.057404 0.075293 0.001899 -0.187955 0.223319 0.246722 -0.040026
polarizability: 2.38035606e+02 -2.26634527e-01 1.35955369e+02 4.75167227e-02 3.91338132e+00 9.07590444e+01
1716.lowfreq: -65.3028 -12.7215 -5.5381 -0.0012 -0.0012 0.0003 3.8908 9.1106 40.2860
frequency: -65.2971 -9.2214 40.1023 43.7061 74.4552 88.1531 97.8961 118.5110 159.9539 169.6365 207.5572 222.1838 256.5578 319.3112 328.0038 354.8209 370.6941 385.1948 414.7335 473.1005 497.6653 537.6385 564.7849 583.1425 619.1007 648.8635 677.9045 728.6824 814.6749 828.8574 833.6745 867.9990 923.0417 928.5031 952.7423 962.6564 981.7327 990.7223 1002.1287 1033.4341 1058.5898 1106.8857 1108.7513 1122.1417 1184.3468 1217.0567 1265.3848 1296.7063 1371.4339 1378.9356 1405.0268 1409.1364 1439.6093 1447.2864 1467.6252 1473.6554 1477.3493 1505.5115 1595.9390 1601.8334 1643.6263 2974.5435 2989.6822 3074.5768 3081.2604 3103.5113 3128.4790 3140.1119 3164.2818 3169.2010 3201.7706 3521.0436
redmass: 1.0466 3.3150 5.0135 5.0016 4.8489 4.3551 5.3816 1.1457 5.0989 6.8501 6.8127 4.6707 7.3761 7.3815 7.1489 5.2127 5.6670 5.8895 2.9683 6.6861 5.5634 3.6624 5.4020 2.8927 6.9756 1.1994 6.1941 3.3432 5.1999 9.4451 1.4365 1.4363 9.0749 6.5402 15.2744 1.3843 2.0608 3.0895 1.3332 1.6709 2.4223 1.3139 1.2887 1.3090 1.1251 3.3883 1.9052 1.4084 3.8089 1.2589 1.1219 5.0341 1.0494 1.1296 1.0466 1.0627 2.2705 2.0629 6.4618 5.6269 5.2778 1.0281 1.0387 1.0983 1.1060 1.1026 1.0903 1.0979 1.0917 1.0956 1.0951 1.0766
irintensity: 0.0251 5.7633 1.0375 4.1725 6.0747 0.6884 3.1856 0.1922 8.3551 5.2913 4.4746 9.6862 9.6929 2.3734 6.4725 19.9216 1.4682 1.8631 0.0188 20.3504 58.0684 100.8740 123.0769 3.8174 4.6979 61.7143 5.7410 0.0882 18.2228 100.9852 22.1209 50.6823 93.2482 5.4355 80.9071 1.5378 25.3599 4.9354 3.1633 8.5645 47.5658 11.1885 6.6532 10.1615 33.4329 72.2656 60.4545 53.9710 222.0718 83.4057 0.6390 18.2443 14.1909 43.5542 20.9738 27.6361 41.6343 404.5044 120.6222 27.6580 119.9611 47.5963 6.0750 12.6597 23.7595 10.9060 12.8542 5.9006 2.4157 6.1555 10.1236 15.9110
temp: 298.150 k
press: 1.00000 atm
elementType: 16 8 8 8 8 7 6 6 6 6 6 6 6 6 6 1 1 1 1 1 1 1 1 1 1 1
symmnumber: 1
zpe: 497812.9 jmol-1
zpe.correction: 0.189607 hartree
zpe.thermalcorrener: 0.204375 hartree
zpe.thermalcorrenthalpy: 0.205319 hartree
zpe.thermalcorrgfe: 0.146549 hartree
zpe.sumelectzpe: -1101.976030 hartree
zpe.sumelectthermal: -1101.961262 hartree
zpe.sumelectthermalent: -1101.960318 hartree
zpe.sumelectthermalfe: -1102.019088 hartree
dipole: -4.9847 3.6669 2.8933
dipole: 6.8311
quadrupole: -81.2647 -96.0499 -100.3603
quadrupole: -18.8818 9.6780 0.2047
quadrupole: 11.2936 -3.4916 -7.8020 -18.8818 9.6780 0.2047
hfenergy: -1102.1656371 hartree
pointgroup: C01 [X(C9H11N1O4S1)]
dipole: -1.9317401 -1.4748411 -1.1472813 debye
dipolederiv: 2.258592 0.0615886 0.0001571 0.1703242 1.1925799 -0.0435662 -0.3259869 -0.0817946 1.5671343 -1.0084777 -0.0687937 0.1579232 -0.1130291 -0.448001 0.0493682 0.3416194 0.0668511 -0.7119156 -0.7270109 -0.0471351 -0.0274584 -0.0923314 -0.5655391 -0.1525144 0.0416673 -0.0408166 -0.5753159 -0.7590105 0.0436319 -0.0493193 0.0451815 -0.6058737 0.1402493 0.0427388 0.0453501 -0.5340867 -0.6966016 -0.0698485 -0.0350653 0.5498845 -0.9208398 -0.0188064 0.0149277 -0.0646891 -0.3334138 -2.1891373 0.3136645 -0.109265 0.5160905 -0.4203851 0.0344892 -0.1291622 0.02258 -0.3362758 -0.3504957 0.0242719 -0.0287788 0.0029134 -0.1611713 0.0013113 -0.1489571 -0.0015493 -0.2038201 1.5912464 -0.0370278 0.1105534 0.2995924 0.0811853 0.0201002 0.1740595 -0.0080805 0.139877 0.1188333 0.0560483 0.033988 -0.2983786 0.0320577 0.0001906 0.0090161 0.0319399 -0.0691704 0.0478806 -0.0627571 0.016905 0.2883596 0.037616 0.0248984 0.0650851 -0.0089029 -0.0701026 -0.4529393 -0.0773571 -0.0222856 -0.2592098 -0.0702959 -0.0144582 -0.0474569 -0.0002783 -0.1483359 -0.4801949 0.0897999 -0.0029842 0.2160131 0.0355917 0.0410658 0.0007031 0.0339352 -0.1824973 1.9200402 -0.1771828 0.131001 -1.0674656 1.240155 0.0243485 0.0773919 0.0880853 0.1947503 0.647378 0.0666072 -0.247026 0.0282999 0.2490565 -0.0098228 0.1763791 0.0365106 0.0613135 -0.4626893 -0.1069386 -0.0575238 -0.2404558 -0.08741 -0.039776 -0.0897952 -0.0301212 0.0398158 0.1242384 -0.049545 -0.0184266 -0.0345857 0.0604755 -0.0077169 -0.0079387 -0.021065 0.1440634 0.1133912 0.0690619 -0.0072937 0.0420698 0.0785355 -0.0099868 -0.0024592 0.0070588 0.1508509 0.1528087 0.0386232 0.0019016 -0.0108545 0.0860142 -0.0098958 -0.0116888 -0.0075413 0.1832594 -0.0204222 -0.1019947 -0.0240827 -0.0886407 -0.0384486 -0.0267159 -0.0341682 -0.030951 0.1644247 0.1731467 0.0224311 -0.0119787 -0.008345 0.102732 -0.0216999 -0.0121246 -0.0175283 0.3006156 -0.0295108 -0.0431364 0.0512126 -0.0896207 -0.0549069 -0.0618595 -0.0906118 -0.1089164 0.0834609 -0.0273389 -0.0260482 0.0796821 -0.0222524 0.1333453 0.0336477 0.0262086 0.0272221 -0.0659344 -0.0716668 0.0388902 0.0487737 0.1152308 -0.052672 0.0384464 -0.0857643 0.0536076 0.1125009 0.0573062 0.0037319 0.0318679 -0.0204043 0.0680209 -0.0942299 -0.0193325 -0.0922325 -0.0482509 0.0118377 0.0470504 -0.0036143 0.1168929 0.0155844 -0.0053328 0.0071981 -0.0099547 0.133539 0.0587965 -0.0076357 -0.0188632 -0.0452789 0.0125932 0.1082662 0.0284518 0.111281 0.0035137 unknown
polarizability: 237.996392|1.1259316|136.0585116|1.9675143|3.3667257|90.6951161 unknown
InChI: InChI=1S/C9H11NO4S/c1-7(11)10-8-3-5-9(6-4-8)15(12,13)14-2/h3-6,10H,1-2H3
charge 0 multiplicity 1
26 atoms
S  2.964044 0.030298 0.52794
O  3.38262 0.286133 -1.279022
O  3.310203 1.398743 1.328569
O  3.605394 -1.383985 1.003053
O  -3.877307 1.544631 -0.02192
N  -3.024117 -0.639759 -0.150665
C  1.123593 -0.1473 0.30564
C  -1.631599 -0.424488 0.006957
C  0.325083 1.006585 0.347201
C  0.604632 -1.4396 0.12113
C  -1.06991 0.8695 0.199935
C  -0.78723 -1.570928 -0.025295
C  -4.06467 0.304509 -0.161611
C  4.831318 0.497112 -1.482211
C  -5.446919 -0.313123 -0.36406
H  0.776503 1.990334 0.508178
H  1.266083 -2.310964 0.111185
H  -1.72465 1.741283 0.229125
H  -1.220577 -2.56837 -0.167652
H  -3.306518 -1.615402 -0.274997
H  5.182422 1.403316 -0.955841
H  4.925258 0.638142 -2.571985
H  5.413534 -0.387796 -1.166758
H  -5.518975 -0.821242 -1.343653
H  -6.197452 0.488744 -0.328127
H  -5.678962 -1.052375 0.424884
