program: Gaussian 09
title: 000149289
version: EM64L-G09RevD.01
frameworkgroup: C1[X(C23H26O3)]
method: RPBEPBE
basis: SDD
operation: Freq
keyword: #pfreq=noraman
keyword: PBEPBE/SDD
title: #p freq=noraman PBEPBE/SDD
converged: YES YES NO NO
title: Mulliken charges:
elementType: O O O C C C C C C C C C C C C C C C C C C C C C C C H H H H H H H H H H H H H H H H H H H H H H H H H H
charge: -0.296046 -0.261424 -0.311947 0.317452 -0.267997 -0.375543 -0.746889 -0.736202 -0.273791 0.268664 0.358450 -0.796859 -0.804037 -0.494699 0.562327 -0.513367 -0.469552 0.338239 -0.191089 -0.397789 0.338761 -0.347618 -0.384086 -0.199327 -0.194739 -0.262793 0.262577 0.258502 0.210907 0.257859 0.211748 0.223672 0.221187 0.213686 0.201028 0.227200 0.220071 0.222050 0.234529 0.226745 0.223934 0.223585 0.255524 0.302711 0.236665 0.229867 0.260234 0.268229 0.256425 0.236365 0.228502 0.228098
chargesum: 0.00000
title: Mulliken charges with hydrogens summed into heavy atoms:
elementType: O O O C C C C C C C C C C C C C C C C C C C C C C C
charge: -0.296046 -0.261424 -0.311947 0.317452 -0.005420 -0.117041 -0.066374 -0.077657 -0.072763 0.268664 0.358450 -0.127538 -0.118830 -0.015590 0.562327 -0.210656 -0.232887 0.338239 0.038778 -0.137554 0.338761 -0.079390 -0.127660 0.037038 0.033763 -0.034694
polarizability: 2.68663958e+02 -7.16092035e+00 2.91787548e+02 -1.20985058e+01 -2.26741453e+01 2.21386147e+02
1716.lowfreq: -1.6565 -0.0008 -0.0007 -0.0003 5.4128 10.9330 17.1999 23.9742 24.4658
frequency: 16.8610 23.7500 24.3149 33.5147 45.9708 47.6587 55.2160 67.0510 79.2743 109.3265 122.2107 137.7535 150.7029 167.9697 174.5922 183.1217 198.4786 220.4476 222.4646 233.0456 250.7847 268.7046 294.8614 304.9616 318.4380 325.4309 349.3672 366.0629 399.8913 411.2627 421.0173 437.1543 449.9784 475.8801 484.0897 507.6776 510.4241 521.0050 563.8680 587.5940 606.5362 612.7757 634.5222 678.9648 692.1170 699.4983 717.3824 720.2010 758.6762 762.3171 801.2200 814.9236 817.1627 835.6997 844.7574 860.4214 889.5144 897.9782 901.2041 919.1977 933.3647 948.4767 950.2476 957.4565 969.4033 975.9846 980.0468 985.4347 987.5240 988.9364 991.8696 1004.3904 1006.3648 1019.4314 1040.5460 1047.9737 1077.4463 1079.0222 1083.0838 1086.8942 1123.5542 1140.5387 1155.7045 1166.8127 1170.7136 1172.8458 1181.8781 1197.6741 1220.3809 1229.9348 1243.6238 1251.7081 1287.9944 1299.9520 1310.6321 1324.2948 1347.7699 1360.9565 1382.0603 1387.4632 1389.2463 1391.1349 1400.1409 1401.9087 1413.3702 1435.5236 1442.9011 1454.6943 1462.7548 1464.2939 1468.1365 1470.1336 1470.6401 1473.1483 1477.5432 1480.8555 1483.3650 1489.1894 1593.3678 1595.2433 1609.2773 1612.7954 1615.6208 1681.5432 2955.3516 2964.7582 2975.6876 2979.2544 3026.0251 3026.5831 3031.6256 3057.2647 3067.5401 3075.9908 3080.8810 3090.1598 3093.9402 3103.5658 3108.3150 3128.9570 3130.7579 3137.3991 3140.5955 3145.6220 3149.6498 3153.3310 3157.6642 3167.6790 3173.0722 3174.7681
redmass: 4.6261 5.1523 4.3767 5.0121 4.3913 3.7608 3.7073 5.4542 4.2281 3.3376 3.7875 2.5743 1.0424 2.0641 1.5057 1.1711 3.3282 1.6367 3.9953 2.3518 5.3221 2.9548 3.5777 4.4082 3.6181 3.1621 3.6785 3.0805 2.5391 2.9264 2.5843 2.9710 2.9217 3.2662 3.3382 3.2734 3.2043 4.4688 7.6731 5.8261 4.5185 6.1385 5.4414 3.9467 2.3518 3.1502 3.4395 4.2167 2.9850 1.9573 1.7118 5.2886 3.7610 1.2579 2.7543 1.7294 2.4242 1.8731 1.4266 1.5999 2.7946 2.1414 1.7417 1.4227 1.3629 1.3419 1.4531 2.7849 5.7814 1.7264 1.2685 1.9393 1.4405 2.0673 1.5867 1.6128 1.4825 1.4915 1.4703 1.5481 1.8491 1.9314 3.2236 1.1394 1.1194 1.1776 2.2969 2.4168 3.1738 1.1879 2.3750 3.3039 1.4704 1.2999 1.3062 1.6190 1.3774 1.7276 7.7201 1.2530 1.2898 7.5220 1.2873 1.3201 1.8617 2.7034 2.4221 1.0498 1.0537 1.1265 1.0519 1.7684 1.1591 1.0775 1.0933 2.5536 1.1271 1.0668 6.2977 6.6082 6.6718 6.8345 8.5320 6.2562 1.0373 1.0389 1.0374 1.0367 1.0967 1.0590 1.0963 1.0989 1.0989 1.0982 1.0974 1.0897 1.0964 1.1062 1.0970 1.0877 1.0849 1.0890 1.0895 1.0866 1.0927 1.0926 1.0934 1.0952 1.0977 1.1000
irintensity: 0.0449 0.1228 0.4261 0.7817 0.7980 0.5793 0.0749 1.1715 0.2248 1.1266 0.2677 0.0242 0.1277 0.5105 0.2203 2.4352 2.5261 0.1664 1.6353 5.3183 3.8428 0.1477 2.5718 0.6039 1.2310 0.9627 0.2328 2.1492 8.4165 0.2582 1.0917 8.3948 11.2216 10.6908 12.9936 1.7182 6.0413 12.3482 0.2984 4.0418 3.1581 1.1181 2.9815 5.9411 30.3623 17.7364 0.6406 9.7605 44.3072 47.3106 51.7398 21.0192 2.0325 2.1529 1.4028 24.8116 57.9287 5.6525 10.6594 20.1018 37.4023 43.5620 22.9844 3.8020 0.3001 0.3573 42.0527 0.7498 0.5072 1.0056 4.4471 5.1805 5.2466 12.8908 9.3328 42.7709 2.5150 19.1170 8.3032 3.8013 63.5388 6.3620 64.9690 30.8549 27.7612 23.6647 12.2562 142.2120 132.6922 19.2536 11.9951 223.8111 34.4818 3.8978 0.4611 1.5619 31.1713 14.5510 10.3228 8.0014 33.4897 2.9531 14.5768 19.8974 4.1885 40.4134 15.3869 2.0370 7.9960 33.6659 12.3003 98.3528 41.5007 41.4881 6.6810 21.6278 13.8487 8.9120 60.1228 96.2725 39.8408 20.8256 238.3703 2.0832 42.3178 44.2584 27.4971 60.1093 15.6148 33.8617 44.3702 17.9411 38.5276 17.5176 29.7874 25.0955 31.6049 9.0446 11.9569 6.8969 0.8815 1.7477 12.0003 9.2838 24.7629 0.7216 28.0883 14.3065 10.7832 4.1503
temp: 298.150 k
press: 1.00000 atm
elementType: 8 8 8 6 6 6 6 6 6 6 6 6 6 6 6 6 6 6 6 6 6 6 6 6 6 6 1 1 1 1 1 1 1 1 1 1 1 1 1 1 1 1 1 1 1 1 1 1 1 1 1 1
symmnumber: 1
zpe: 1119530.6 jmol-1
zpe.correction: 0.426407 hartree
zpe.thermalcorrener: 0.452697 hartree
zpe.thermalcorrenthalpy: 0.453641 hartree
zpe.thermalcorrgfe: 0.367525 hartree
zpe.sumelectzpe: -1115.774976 hartree
zpe.sumelectthermal: -1115.748686 hartree
zpe.sumelectthermalent: -1115.747742 hartree
zpe.sumelectthermalfe: -1115.833857 hartree
dipole: 2.0914 0.3426 2.3479
dipole: 3.1629
quadrupole: -148.3553 -138.5081 -158.1910
quadrupole: 0.9867 -0.4724 -7.3978
quadrupole: -0.0039 9.8434 -9.8395 0.9867 -0.4724 -7.3978
hfenergy: -1116.2013823 hartree
pointgroup: C01 [X(C23H26O3)]
dipole: 0.8394502 -0.0703914 -0.9159124 debye
polarizability: 266.1835084|3.5265909|284.9157435|18.0615905|-30.062385|230.7384013 unknown
InChI: InChI=1S/C23H26O3/c1-16(2)13-20-21(23(20,3)4)22(24)25-15-17-9-8-12-19(14-17)26-18-10-6-5-7-11-18/h5-14,20-21H,15H2,1-4H3
charge 0 multiplicity 1
52 atoms
O  0.820366 2.384908 0.068625
O  0.606398 1.714634 2.299915
O  -3.384743 -1.012536 -0.097899
C  3.764898 1.344267 0.223599
C  2.82959 0.302536 -0.411726
C  2.487067 0.903122 1.003056
C  3.839504 2.728482 -0.417665
C  5.090432 0.894928 0.841021
C  3.150589 -1.141425 -0.541701
C  1.250685 1.691296 1.22011
C  2.646731 -2.01082 -1.470092
C  3.078808 -3.468102 -1.480836
C  1.644964 -1.640959 -2.549874
C  -0.505261 3.086414 0.171783
C  -1.575127 2.260316 -0.510268
C  -1.959391 1.017808 0.053773
C  -2.180636 2.706361 -1.71009
C  -2.916324 0.221423 -0.610311
C  -3.168797 1.915044 -2.341313
C  -3.536014 0.665382 -1.801383
C  -2.527653 -1.887703 0.622672
C  -1.144871 -2.014252 0.352529
C  -3.161982 -2.713029 1.576584
C  -0.392136 -2.972451 1.067828
C  -2.398072 -3.671356 2.277539
C  -1.010705 -3.80294 2.030949
H  2.191226 0.723049 -1.195339
H  2.682686 0.251038 1.860575
H  4.144357 3.488487 0.327018
H  2.87212 3.035813 -0.844732
H  4.596137 2.7238 -1.225042
H  5.450453 1.65304 1.560937
H  5.860311 0.777677 0.055058
H  5.009342 -0.064312 1.380854
H  3.866506 -1.544698 0.189742
H  3.810024 -3.688324 -0.683501
H  3.53907 -3.739665 -2.451938
H  2.208413 -4.142086 -1.347601
H  1.309848 -0.592535 -2.499021
H  0.747133 -2.28736 -2.482821
H  2.077149 -1.810978 -3.556097
H  -0.348719 4.051173 -0.335945
H  -0.718639 3.241256 1.244332
H  -1.513297 0.686838 0.997288
H  -1.880366 3.664749 -2.149118
H  -3.644825 2.265042 -3.263568
H  -4.286688 0.028712 -2.278736
H  -0.660017 -1.38129 -0.39647
H  -4.234914 -2.592102 1.753227
H  0.681586 -3.059367 0.865901
H  -2.887255 -4.310713 3.020657
H  -0.420164 -4.54169 2.583017
