program: Gaussian 09
title: 000149222
version: EM64L-G09RevD.01
frameworkgroup: C1[X(C9H11NO5S)]
method: RPBEPBE
basis: SDD
operation: Freq
keyword: #p
keyword: freq=noraman
keyword: PBEPBE/SDD
title: #p freq=noraman PBEPBE/SDD
converged: YES YES NO NO
title: Mulliken charges:
elementType: S O O O O O N C C C C C C C C C H H H H H H H H H H H
charge: 0.980384 -0.409076 -0.495925 -0.504953 -0.193303 -0.186568 0.024805 0.016539 0.011503 -0.666124 -0.655059 -0.362318 -0.245717 0.407729 -0.165844 -0.346539 0.242428 0.214242 0.238139 0.228612 0.211050 0.247273 0.225279 0.331548 0.298293 0.256890 0.296713
chargesum: 0.00000
title: Mulliken charges with hydrogens summed into heavy atoms:
elementType: S O O O O O N C C C C C C C C C
charge: 0.980384 -0.409076 -0.495925 -0.504953 -0.193303 -0.186568 0.024805 0.258967 0.011503 0.014869 0.028542 -0.030770 0.052575 0.407729 0.091046 -0.049826
polarizability: 2.02853900e+02 -4.87601429e-03 1.51964549e+02 9.71985681e+00 -1.65149991e+01 1.07465649e+02
1716.lowfreq: -11.8609 -8.6453 -2.7551 -0.0019 -0.0018 0.0006 15.3525 29.8256 40.1826
frequency: 14.4891 29.7034 40.0964 58.4226 69.8561 107.3241 142.6414 163.2854 181.3843 195.7694 210.3615 223.9444 238.8078 243.4344 287.9572 341.9156 357.5665 386.7568 398.5315 424.5726 438.3225 482.0798 509.0720 516.0695 570.4603 637.2922 667.1703 688.5725 702.2642 763.5813 800.1131 821.7156 832.3653 885.8232 929.0134 938.1700 940.1297 955.4319 962.3807 980.8141 1010.1640 1055.3075 1081.2205 1097.9572 1099.8495 1147.3773 1170.6027 1174.1027 1213.7814 1269.2099 1307.9793 1336.3708 1377.4395 1378.0064 1399.3628 1403.2079 1425.9863 1447.3919 1452.7931 1462.1415 1468.7033 1483.9080 1586.0319 1602.3648 2988.3141 2993.3475 2998.8327 3085.1925 3091.9822 3098.0589 3108.5906 3157.9314 3172.4508 3175.0016 3189.7576
redmass: 5.0418 3.0448 6.1630 7.6871 5.4475 10.3816 4.9627 5.5807 1.0421 7.1646 5.3947 1.3411 4.8257 5.0883 4.1078 5.8521 3.8510 5.7087 8.5931 3.1971 3.1168 7.4921 5.5863 7.3097 6.6238 7.3416 3.4074 9.4230 3.9966 4.0738 10.1400 1.4621 10.4558 2.6824 1.2340 1.3649 1.4159 6.4394 1.5759 5.9508 1.3634 1.9527 1.9239 1.7022 2.5185 2.2272 1.1251 1.9179 10.0590 1.3154 1.2338 1.3950 3.1756 1.6038 1.2149 8.6408 3.0626 2.3785 1.0473 1.0486 1.0464 1.0523 6.9623 7.6971 1.0359 1.0362 1.0849 1.0992 1.0994 1.1002 1.1009 1.0889 1.0938 1.0932 1.0978
irintensity: 1.9916 1.0160 0.5283 0.9157 1.4715 4.4683 8.2115 0.6225 0.0653 1.9654 2.3834 1.1565 5.3784 2.0146 3.5147 11.6307 7.4487 9.8330 1.1868 0.6317 7.2337 108.7202 18.4714 7.1973 95.5790 9.0920 15.6247 16.5556 25.2366 67.9471 20.6707 51.9900 65.8948 12.6099 3.6871 2.8591 13.4703 65.2337 11.6890 1.3610 1.2318 25.5990 34.3437 96.1591 13.7431 29.7015 17.3176 7.8708 230.9714 0.0641 11.2661 22.3118 48.4003 48.4666 24.5542 5.4491 57.1822 21.7675 8.0257 1.8420 14.2371 13.5544 1.8418 3.4411 12.7157 19.1331 10.7112 14.9854 20.4084 26.2303 26.9451 4.5240 5.4335 16.8642 2.2424
temp: 298.150 k
press: 1.00000 atm
elementType: 16 8 8 8 8 8 7 6 6 6 6 6 6 6 6 6 1 1 1 1 1 1 1 1 1 1 1
symmnumber: 1
zpe: 506309.8 jmol-1
zpe.correction: 0.192843 hartree
zpe.thermalcorrener: 0.209804 hartree
zpe.thermalcorrenthalpy: 0.210749 hartree
zpe.thermalcorrgfe: 0.145609 hartree
zpe.sumelectzpe: -1177.022029 hartree
zpe.sumelectthermal: -1177.005068 hartree
zpe.sumelectthermalent: -1177.004124 hartree
zpe.sumelectthermalfe: -1177.069263 hartree
dipole: 1.1021 1.5265 -3.6802
dipole: 4.1338
quadrupole: -105.2630 -101.3674 -106.1282
quadrupole: -22.3963 -0.4150 -2.9231
quadrupole: -1.0102 2.8855 -1.8753 -22.3963 -0.4150 -2.9231
hfenergy: -1177.2148724 hartree
pointgroup: C01 [X(C9H11N1O5S1)]
dipole: 0.4686229 1.0162364 -1.1801342 debye
polarizability: 201.4507124|-1.0194259|157.2456199|15.5521341|-0.8427221|103.5877657 unknown
InChI: InChI=1S/C9H11NO5S/c1-7(2)15-16(13,14)9-5-3-4-8(6-9)10(11)12/h3-7H,1-2H3
charge 0 multiplicity 1
27 atoms
S  1.580308 0.564343 1.019278
O  2.335833 -0.004552 -0.582192
O  2.157385 2.01432 1.454446
O  1.602242 -0.681672 2.0580
O  -4.414787 -1.015584 -0.790797
O  -2.800684 -2.40029 0.037265
N  -3.230572 -1.244536 -0.335523
C  3.590651 -0.814957 -0.404373
C  -0.156929 0.800246 0.330728
C  3.754534 -1.494697 -1.7720
C  4.769945 0.082879 -0.006725
C  -0.994095 -0.319099 0.263147
C  -0.535393 2.096028 -0.055965
C  -2.293204 -0.089926 -0.23594
C  -1.84791 2.280778 -0.55073
C  -2.733884 1.187376 -0.646713
H  3.39182 -1.57307 0.379832
H  4.64888 -2.144093 -1.751165
H  2.874465 -2.113431 -2.014029
H  3.88779 -0.740547 -2.566796
H  5.690027 -0.523326 0.083416
H  4.591872 0.578625 0.963786
H  4.935511 0.864629 -0.768449
H  -0.679951 -1.31531 0.588297
H  0.169608 2.927752 0.042413
H  -2.175516 3.277417 -0.860286
H  -3.752847 1.303197 -1.025226
