program: Gaussian 09
title: 000008900
version: EM64L-G09RevD.01
frameworkgroup: C1[X(C7H16)]
method: RPBEPBE
basis: SDD
operation: Freq
keyword: #p
keyword: freq=noraman
keyword: PBEPBE/SDD
title: #p freq=noraman PBEPBE/SDD
converged: YES YES NO NO
title: Mulliken charges:
elementType: C C C C C C C H H H H H H H H H H H H H H H H
charge: -0.360189 -0.348823 -0.348891 -0.354840 -0.354861 -0.695329 -0.695286 0.185280 0.185174 0.185965 0.185913 0.185991 0.185923 0.194231 0.194196 0.194237 0.194225 0.214603 0.209464 0.209484 0.209465 0.209461 0.214607
chargesum: 0.00000
title: Mulliken charges with hydrogens summed into heavy atoms:
elementType: C C C C C C C
charge: 0.010265 0.023055 0.023023 0.033587 0.033600 -0.061778 -0.061752
polarizability: 9.52481777e+01 1.88469058e-04 6.92729814e+01 2.27690599e-03 1.35939215e-04 6.62893318e+01
1716.lowfreq: -6.9395 -0.0003 0.0000 0.0008 16.4439 51.0055 64.8868 78.6794 94.4035
frequency: 64.7914 78.6545 94.4035 134.9967 137.3033 223.8037 226.6879 235.0173 294.4434 403.0817 468.6111 723.4557 730.3340 764.7968 835.7909 871.7694 906.0430 923.4916 993.1467 1005.9872 1045.9416 1063.7950 1077.6052 1086.8661 1136.9154 1180.2489 1212.1135 1235.0190 1257.4242 1282.7264 1286.5319 1291.6055 1296.3292 1330.1186 1352.8126 1354.0076 1388.0483 1388.4301 1463.8163 1464.3648 1469.5815 1474.6857 1475.9985 1476.0865 1480.7198 1486.8275 1490.6315 2951.8023 2952.9138 2958.7947 2967.2445 2970.6658 2971.4335 2971.8961 2986.0069 2995.1908 3009.2214 3025.2471 3039.5947 3068.1899 3068.9196 3069.9462 3070.1464
redmass: 2.7745 1.5020 2.9848 2.2754 1.6707 1.1085 1.1530 2.6695 3.6393 2.6217 2.9036 1.0610 1.0838 1.1311 1.1729 2.0688 1.6197 1.1717 4.4899 1.0993 3.2063 1.9757 2.5177 1.9248 2.6630 1.8968 1.4775 1.3057 1.2718 1.0403 1.3207 1.1455 1.0819 1.4207 1.5794 1.6884 1.2132 1.2206 1.0675 1.0729 1.0661 1.0630 1.0423 1.0426 1.0676 1.0815 1.0939 1.0587 1.0587 1.0589 1.0588 1.0575 1.0367 1.0377 1.0967 1.0993 1.1022 1.1040 1.1044 1.1007 1.1007 1.0993 1.0992
irintensity: 0.0071 0.0000 0.0452 0.0000 0.0022 0.0000 0.0011 0.0000 0.0117 0.2291 0.1046 14.6573 0.0004 4.2060 0.0000 5.5886 4.0427 2.2170 0.0231 0.0000 0.1029 12.2648 0.6553 6.6319 2.7466 0.4329 0.0000 1.8462 0.0155 0.0000 0.0858 0.0000 0.8983 0.3616 0.5093 1.0737 9.6205 13.0548 0.0019 0.1124 0.0759 3.3956 0.3742 24.2507 0.2500 2.9388 29.8793 0.0431 0.0873 8.4151 3.1648 206.4940 57.2828 4.2663 0.0029 0.0006 0.4103 0.0334 111.3546 0.8496 194.4226 43.9166 66.1722
temp: 298.150 k
press: 1.00000 atm
elementType: 6 6 6 6 6 6 6 1 1 1 1 1 1 1 1 1 1 1 1 1 1 1 1
symmnumber: 1
zpe: 560708.1 jmol-1
zpe.correction: 0.213562 hartree
zpe.thermalcorrener: 0.223525 hartree
zpe.thermalcorrenthalpy: 0.224469 hartree
zpe.thermalcorrgfe: 0.178448 hartree
zpe.sumelectzpe: -275.732056 hartree
zpe.sumelectthermal: -275.722094 hartree
zpe.sumelectthermalent: -275.721149 hartree
zpe.sumelectthermalfe: -275.767171 hartree
dipole: -0.0001 0.0615 0.0002
dipole: 0.0615
quadrupole: -48.9446 -47.9148 -46.5140
quadrupole: 0.0000 -0.0016 -0.0001
quadrupole: -1.1535 -0.1237 1.2772 0.0000 -0.0016 -0.0001
hfenergy: -275.9456187 hartree
pointgroup: C01 [X(C7H16)]
dipole: 0.0000666 -0.0241861 -0.0001235 debye
dipolederiv: -0.0595645 -0.0002317 0.0002396 -0.0002247 0.0956264 -0.0007924 0.00006 -0.0005226 0.1910076 -0.0553151 0.0011216 0.0001718 -0.03424 0.0759092 -0.000987 -0.0002143 -0.0009547 0.1844173 -0.0553842 -0.0011563 0.000166 0.0341904 0.0758476 -0.0008909 0.0005552 -0.0011394 0.1844056 0.0244941 0.0042325 0.0001083 0.052246 0.1014413 -0.0008334 0.0005563 -0.0008425 0.1761186 0.0244569 -0.0042609 0.0000909 -0.0522154 0.1012094 -0.0006266 -0.0001986 -0.0006016 0.1761213 -0.0789924 0.0487952 0.0006648 0.0141842 0.0519264 -0.0005122 0.0002398 -0.0005821 0.0962011 -0.0788636 -0.0490868 -0.0002192 -0.0145136 0.0517581 -0.0003564 0.0001245 -0.0003191 0.0961839 0.0376999 0.0001353 -0.0001564 0.0001351 -0.0507603 0.1168149 -0.0001523 0.1433212 -0.0929616 0.0378004 0.0000622 0.000054 0.0000558 -0.0468238 -0.1161317 0.0000864 -0.1426465 -0.0969284 0.0355822 -0.0057711 0.0027802 0.0025083 -0.0509403 0.1187413 -0.002639 0.1440311 -0.0919795 0.0356567 -0.0055088 -0.0027774 0.0026448 -0.0463678 -0.1179378 0.0028181 -0.1432312 -0.0966006 0.0356412 0.0054825 0.0027833 -0.0026396 -0.0462535 -0.1178215 -0.0027697 -0.14316 -0.0966215 0.0356806 0.0059283 -0.0029999 -0.0023683 -0.0509453 0.1186715 0.0023848 0.1439884 -0.0919195 0.0280267 0.0231096 0.0236243 -0.0025665 -0.0455566 -0.1238788 -0.0008604 -0.1524452 -0.095768 0.028139 0.0240622 -0.0233498 -0.0022651 -0.0516692 0.1248431 0.0005421 0.1533559 -0.089649 0.0282292 -0.0234632 0.0229701 0.0026751 -0.0509438 0.1246784 -0.0010659 0.1532532 -0.0903727 0.0281363 -0.0235825 -0.0237401 0.0022581 -0.0462237 -0.1239393 0.0006995 -0.1524306 -0.0950019 -0.1835252 -0.0987954 -0.0011728 -0.1361313 0.0034656 -0.0012281 -0.001639 -0.0011956 0.0988712 0.0790362 -0.0003887 0.0217994 0.0484672 -0.0219262 0.1242469 -0.0260028 0.1407302 -0.0878191 0.0788875 0.0001994 -0.0217989 0.0478186 -0.015314 -0.1224371 0.0272012 -0.1389162 -0.0943754 0.0790473 0.0006232 -0.0222129 -0.0480255 -0.0207974 0.1239365 0.0257636 0.1404441 -0.0889376 0.0790976 -0.0000457 0.0218386 -0.0478731 -0.016506 -0.1226406 -0.0269447 -0.1392626 -0.0932509 -0.1839668 0.098539 0.0011359 0.1358794 0.0038441 -0.0009186 0.0014554 -0.000874 0.0988591 unknown
polarizability: 95.2481446|0.0174932|69.2727552|-0.0249743|0.026633|66.2895912 unknown
InChI: InChI=1S/C7H16/c1-3-5-7-6-4-2/h3-7H2,1-2H3
charge 0 multiplicity 1
23 atoms
C  -0.000436 -0.488624 -0.005174
C  -1.292491 0.359901 0.001783
C  1.290561 0.36173 0.000858
C  -2.58391 -0.489757 -0.006153
C  2.583035 -0.486622 -0.008298
C  -3.869182 0.366168 0.004661
C  3.866955 0.371441 -0.002857
H  0.000445 -1.161611 0.87795
H  -0.000188 -1.148412 -0.898215
H  -1.293524 1.03427 -0.880311
H  -1.294288 1.01887 0.895451
H  1.292288 1.020069 0.894929
H  1.290217 1.036225 -0.881071
H  -2.582166 -1.145749 -0.90076
H  -2.580283 -1.165337 0.873734
H  2.582485 -1.159717 0.873438
H  2.579728 -1.144635 -0.901342
H  -4.7776 -0.264281 -0.003316
H  -3.909952 1.029771 -0.879869
H  -3.909963 1.007277 0.905623
H  3.905563 1.03109 -0.890434
H  3.907666 1.01654 0.895266
H  4.77634 -0.257609 -0.008992
