program: Gaussian 09
title: 000149213
version: EM64L-G09RevD.01
frameworkgroup: C1[X(C2H3Cl3O2S)]
method: RPBEPBE
basis: SDD
operation: Freq
keyword: #p
keyword: freq=noraman
keyword: PBEPBE/SDD
title: #p freq=noraman PBEPBE/SDD
converged: YES YES NO NO
title: Mulliken charges:
elementType: Cl Cl Cl S O O C C H H H
charge: 0.087022 0.136336 0.066601 0.994562 -0.504350 -0.528215 -0.622702 -0.664543 0.381983 0.316515 0.336791
chargesum: 0.00000
title: Mulliken charges with hydrogens summed into heavy atoms:
elementType: Cl Cl Cl S O O C C
charge: 0.087022 0.136336 0.066601 0.994562 -0.504350 -0.528215 -0.240718 -0.011238
polarizability: 8.08965329e+01 -3.15217013e+00 8.74244766e+01 -3.86439187e-01 -6.35874427e+00 8.55260692e+01
1716.lowfreq: -7.0272 0.0006 0.0020 0.0037 5.6877 7.8086 27.9875 44.2962 103.4082
frequency: 27.9473 44.2864 103.4062 125.5061 161.6211 177.3759 217.2132 264.2415 278.5864 286.6628 380.6215 460.2532 566.6987 641.3658 709.4309 731.3717 797.8116 834.7992 954.3313 1085.7636 1110.3330 1175.4754 1214.9753 1364.4505 3080.8892 3124.5075 3201.3255
redmass: 17.7347 15.9192 9.3136 16.0366 5.1899 9.3161 15.2823 11.6499 7.7276 13.4369 15.4286 6.7511 10.1366 9.0417 7.6655 9.4431 3.6869 2.1308 11.4275 1.0995 1.0491 1.0717 1.1231 1.0750 1.0514 1.0890 1.1170
irintensity: 0.5762 1.3834 3.7749 0.6864 3.5539 9.2421 2.5574 2.9136 43.7797 13.7397 26.8668 2.4334 8.3155 53.4516 51.1634 122.2779 28.8582 48.1796 70.8287 17.1970 1.1254 9.1422 13.8480 4.3835 1.8377 0.6972 1.1404
temp: 298.150 k
press: 1.00000 atm
elementType: 17 17 17 16 8 8 6 6 1 1 1
symmnumber: 1
zpe: 138295.8 jmol-1
zpe.correction: 0.052674 hartree
zpe.thermalcorrener: 0.063153 hartree
zpe.thermalcorrenthalpy: 0.064097 hartree
zpe.thermalcorrgfe: 0.013990 hartree
zpe.sumelectzpe: -2005.860327 hartree
zpe.sumelectthermal: -2005.849848 hartree
zpe.sumelectthermalent: -2005.848903 hartree
zpe.sumelectthermalfe: -2005.899011 hartree
dipole: 0.6780 -1.7433 -2.3691
dipole: 3.0185
quadrupole: -69.3451 -84.6006 -78.8646
quadrupole: 2.6394 5.5735 -0.1277
quadrupole: 8.2583 -6.9971 -1.2612 2.6394 5.5735 -0.1277
hfenergy: -2005.9130008 hartree
pointgroup: C01 [X(C2H3Cl3O2S1)]
dipole: -0.2016615 -1.1450483 0.2419594 debye
dipolederiv: -0.2009174 -0.0885744 -0.0051938 -0.2435566 -0.5193165 0.3117192 0.1127295 0.2738227 -0.280057 -0.2499742 -0.0323771 -0.2035638 -0.0448386 -0.0628879 -0.0161364 -0.4186393 0.0493212 -0.5989102 -0.113669 0.0532222 0.0372322 0.1560913 -0.2494324 -0.1736277 0.2364361 -0.2991833 -0.3251595 1.1772253 0.1193783 -0.0287645 0.0280384 1.1671568 0.1117348 0.0451452 -0.0445394 0.9495663 -0.5674459 -0.0803745 0.0422698 -0.0444628 -0.6184543 0.0122949 0.069871 0.1891243 -0.4500488 -0.6142207 0.0190377 0.0063337 0.0142526 -0.5687411 -0.0804798 -0.0853666 -0.1910848 -0.6441465 0.4917571 0.1385762 0.2324599 0.3375099 0.5891452 -0.366502 0.3491963 -0.3515797 0.9515518 0.0696032 -0.1158363 -0.1231678 -0.2445624 0.247681 0.2909647 -0.306084 0.4158895 0.3963209 -0.0636537 -0.0540583 -0.0365706 -0.0384347 -0.0063903 0.0231837 -0.0200184 0.0124091 -0.0198098 0.0506275 0.0338435 0.0668424 0.0340951 -0.0045083 -0.0424731 0.0365745 -0.0012339 -0.0130732 0.0206678 0.0071628 0.0121225 0.0458678 0.0257476 -0.0706783 -0.0198444 -0.0529459 0.0337659 unknown
polarizability: 80.9621461|2.7134825|80.4594032|2.5573303|1.4432493|92.4255294 unknown
InChI: InChI=1S/C2H3Cl3O2S/c3-1-8(6,7)2(4)5/h2H,1H2
charge 0 multiplicity 1
11 atoms
Cl -1.64207 -1.737514 1.11933
Cl -1.958706 -0.200442 -1.518706
Cl 1.690563 -1.712959 -1.192822
S  0.37694 0.625393 0.489159
O  0.678487 1.641265 -0.738109
O  0.409071 1.105191 2.05021
C  -1.523528 -0.132908 0.236943
C  1.629214 -0.90667 0.439563
H  -2.119352 0.621182 0.769855
H  1.259568 -1.592501 1.211127
H  2.588112 -0.426036 0.675949
