program: Gaussian 09
title: 000149249
version: EM64L-G09RevD.01
frameworkgroup: C1[X(C20H18N4O3S)]
method: RPBEPBE
basis: SDD
operation: Freq
keyword: #p
keyword: freq=noraman
keyword: PBEPBE/SDD
title: #p freq=noraman PBEPBE/SDD
converged: YES YES NO NO
title: Mulliken charges:
elementType: S O O O N N N N C C C C C C C C C C C C C C C C C C C C H H H H H H H H H H H H H H H H H H
charge: 0.973697 -0.320621 -0.540074 -0.549518 -0.483895 0.055598 -0.483928 0.055431 0.232517 0.237964 0.202086 0.270341 -0.104206 -0.332414 0.163856 -0.339266 0.279960 -0.278725 -0.405602 -0.311049 -0.394535 -0.292532 -0.262759 -0.232532 -0.195508 -0.364818 -0.765831 -0.530180 0.347213 0.267464 0.273654 0.302128 0.243992 0.232365 0.273364 0.232091 0.267259 0.236455 0.234571 0.246326 0.272345 0.296755 0.264196 0.250084 0.243083 0.233202
chargesum: 0.00000
title: Mulliken charges with hydrogens summed into heavy atoms:
elementType: S O O O N N N N C C C C C C C C C C C C C C C C C C C C
charge: 0.973697 -0.320621 -0.540074 -0.549518 -0.136682 0.055598 -0.216669 0.055431 0.232517 0.237964 0.202086 0.270341 -0.104206 -0.332414 0.163856 -0.071802 0.279960 -0.005071 -0.103473 -0.067058 -0.162170 -0.019168 -0.030669 0.003923 0.039063 -0.118492 0.067465 0.196188
polarizability: 6.16696203e+02 -4.67237282e+01 3.54983770e+02 -1.44857327e+01 8.65378864e+00 1.77732315e+02
1716.lowfreq: -9.6413 -4.4252 -2.2189 0.0010 0.0015 0.0022 12.9187 18.9666 20.0501
frequency: 10.4219 18.9432 20.0020 39.9860 44.4141 50.7229 81.6485 92.1346 110.2868 114.1346 116.6728 138.7288 146.4091 156.6328 173.1531 180.6667 215.6941 233.1211 239.1990 251.4146 270.8073 275.9645 294.9534 311.2196 322.3502 366.0632 387.5613 395.5642 397.1956 407.1608 439.1896 451.3462 464.4180 476.9227 506.3942 525.3906 535.9598 539.7268 557.7763 580.3765 591.6879 599.9330 616.7201 633.2997 637.3037 668.8337 705.4186 712.6522 720.3639 762.4804 771.7475 786.1048 793.3813 801.5756 805.2657 826.3178 837.8449 854.0451 861.5014 875.6263 884.8568 888.6975 926.4821 930.7379 931.7652 940.1345 944.2317 971.2078 981.8049 997.7098 998.0898 1003.5729 1018.6217 1030.7195 1066.9807 1100.6373 1117.8478 1121.6382 1153.0254 1155.3350 1174.8117 1178.1205 1181.8248 1198.1274 1220.9768 1252.5717 1264.8089 1278.3172 1282.3786 1288.6223 1315.7275 1346.8936 1353.1727 1380.6623 1390.4188 1399.3737 1409.0568 1415.6213 1424.8907 1434.7397 1446.6144 1452.6005 1466.5990 1467.8040 1472.3028 1482.3990 1497.3759 1513.7530 1537.7491 1552.6349 1575.0003 1589.6638 1605.0189 1624.7681 2979.4914 3028.2218 3075.8884 3119.9379 3129.8004 3134.2791 3136.2996 3136.6987 3149.4112 3166.2362 3168.9991 3171.5066 3175.7497 3178.6094 3182.5653 3190.0114 3339.4759 3479.7163
redmass: 6.1730 5.4208 7.0721 4.7022 5.1725 5.4823 5.0017 4.1068 4.3184 4.1444 7.9726 4.6357 1.5947 2.5029 4.1898 4.3000 1.8280 4.4192 4.1755 2.9528 5.1748 2.8935 4.6182 6.9523 6.1731 7.3882 4.7048 4.3740 5.0430 4.9855 5.8299 3.7878 4.6632 3.4412 3.1881 7.4871 8.1515 5.0031 4.7846 2.6719 5.0905 3.3067 3.9580 5.8052 2.3052 6.1432 5.3232 5.4086 3.8845 3.0650 1.6697 1.5148 4.0329 1.5150 7.5870 3.6927 1.5564 4.5959 1.6508 1.9878 3.7569 2.2179 2.3662 3.4755 2.2880 1.4550 1.3238 1.3525 1.3800 3.0742 1.3298 2.7224 2.2915 2.3275 4.4803 2.3809 1.3483 1.8247 1.3093 1.3734 1.4258 1.5128 1.2417 1.5546 1.9867 2.4904 4.3266 1.1879 2.3519 1.9066 2.3390 2.8039 2.5166 3.4896 1.9277 3.1226 1.0582 1.0580 3.5405 1.5720 3.2142 2.4085 2.0730 1.0489 1.8354 1.4158 6.1556 3.9719 7.3376 6.8040 3.7939 5.7273 6.5494 6.2038 1.0318 1.0238 1.1049 1.0899 1.0897 1.0860 1.0890 1.1018 1.0896 1.0955 1.0990 1.0943 1.0995 1.1072 1.1080 1.0923 1.0754 1.0745
irintensity: 4.0537 1.6907 2.6757 2.3010 1.5650 2.9590 3.7084 19.6938 32.6663 7.8440 45.3008 0.9356 2.2369 6.4033 1.9412 26.5001 6.6521 2.4568 3.2713 6.5587 6.3002 6.4150 0.7857 14.0455 2.1792 46.7653 36.0734 21.3587 7.6389 29.5660 2.8864 4.9155 4.6765 5.4044 0.5092 1.3767 48.7421 15.1116 7.0653 42.2463 12.1004 66.7673 30.0771 2.0709 75.4664 0.3409 1.9228 12.4735 9.0615 45.7020 83.2655 22.1605 7.6769 51.5735 85.3283 4.3794 101.7609 14.4936 21.2293 5.8003 2.0271 16.8008 1.1750 2.8268 8.7951 0.6196 143.2599 1.7460 0.4974 41.9865 0.6003 67.6203 3.8488 3.7798 11.2298 1.7917 19.2566 85.5731 1.9908 2.4330 46.8358 35.9559 6.8701 5.3936 23.9885 13.7397 2.3763 23.2371 25.2586 19.3535 54.3985 140.6350 116.5228 57.4523 5.2078 45.5831 5.1602 11.6932 134.3698 5.4793 20.8531 1.4238 41.4865 15.0322 99.9854 73.4948 201.3432 491.9215 53.9437 16.9603 42.7053 105.5365 344.9451 3.8480 46.3500 0.8352 25.2362 36.3246 7.6154 4.2317 7.0620 15.8025 9.8710 14.2150 27.9585 3.7293 21.1791 0.2032 1.3311 1.2945 12.2795 68.8745
temp: 298.150 k
press: 1.00000 atm
elementType: 16 8 8 8 7 7 7 7 6 6 6 6 6 6 6 6 6 6 6 6 6 6 6 6 6 6 6 6 1 1 1 1 1 1 1 1 1 1 1 1 1 1 1 1 1 1
symmnumber: 1
zpe: 899503.4 jmol-1
zpe.correction: 0.342603 hartree
zpe.thermalcorrener: 0.368517 hartree
zpe.thermalcorrenthalpy: 0.369461 hartree
zpe.thermalcorrgfe: 0.283516 hartree
zpe.sumelectzpe: -1613.511164 hartree
zpe.sumelectthermal: -1613.485250 hartree
zpe.sumelectthermalent: -1613.484306 hartree
zpe.sumelectthermalfe: -1613.570250 hartree
dipole: 0.9879 0.3088 1.4293
dipole: 1.7647
quadrupole: -251.1716 -135.6789 -169.8291
quadrupole: -25.5651 -3.1121 -3.5122
quadrupole: -65.6117 49.8810 15.7308 -25.5651 -3.1121 -3.5122
hfenergy: -1613.8537666 hartree
pointgroup: C01 [X(C20H18N4O3S1)]
dipole: -0.4224306 -0.3630413 0.4145031 debye
polarizability: 601.1173399|-79.0103432|324.2204675|-15.0484826|81.3744399|224.0744798 unknown
InChI: InChI=1S/C20H18N4O3S/c1-27-18-12-13(24-28(2,25)26)9-10-17(18)22-19-14-6-3-4-8-16(14)23-20-15(19)7-5-11-21-20/h3-12,22,24H,1-2H3
charge 0 multiplicity 1
46 atoms
S  5.881351 -0.93778 -0.548505
O  1.433308 0.980878 2.429114
O  7.29997 -0.81332 -1.335737
O  5.794369 -0.826295 1.076191
N  -0.597977 0.417988 0.871642
N  -4.516555 -0.384281 -0.733975
N  4.638065 0.575122 -1.265813
N  -5.318093 1.650702 0.093115
C  -1.863849 0.127103 0.307855
C  -2.153402 -1.114213 -0.341948
C  -2.912083 1.091638 0.453103
C  0.662554 0.382776 0.260517
C  -3.501407 -1.294745 -0.878752
C  -4.243975 0.770421 -0.060761
C  1.787628 0.705441 1.09741
C  -1.222982 -2.207319 -0.43647
C  3.313818 0.466046 -0.798513
C  0.896789 0.116825 -1.11435
C  3.085123 0.76142 0.582527
C  -2.717405 2.386465 1.047105
C  2.205154 0.119713 -1.628643
C  -3.81605 -2.519339 -1.568536
C  -1.575053 -3.38723 -1.086359
C  -2.876469 -3.538663 -1.677681
C  -3.798017 3.253197 1.171614
C  -5.086275 2.825374 0.695338
C  5.116082 -2.66072 -0.99441
C  2.519013 1.305414 3.365938
H  -0.579401 0.823987 1.813532
H  -0.234312 -2.111307 0.02095
H  0.052012 -0.097856 -1.774001
H  3.947319 1.023097 1.19965
H  -1.718651 2.69613 1.373832
H  2.370516 -0.107483 -2.688874
H  -4.827412 -2.608955 -1.975738
H  -0.859079 -4.214564 -1.140293
H  4.723439 0.442431 -2.294681
H  -3.129978 -4.469702 -2.195979
H  -3.685001 4.248983 1.610746
H  -5.954931 3.486519 0.806585
H  4.072362 -2.639458 -0.651749
H  5.721984 -3.391263 -0.440523
H  5.212695 -2.775247 -2.082686
H  3.252387 0.479875 3.412695
H  2.029989 1.434916 4.341986
H  3.027429 2.24138 3.068429
