program: Gaussian 09
title: 000149211
version: EM64L-G09RevD.01
frameworkgroup: C1[X(C15H28O)]
method: RPBEPBE
basis: SDD
operation: Freq
keyword: #pfreq=noraman
keyword: PBEPBE/SDD
title: #p freq=noraman PBEPBE/SDD
converged: YES YES NO NO
title: Mulliken charges:
elementType: O C C C C C C C C C C C C C C C H H H H H H H H H H H H H H H H H H H H H H H H H H H H
charge: -0.211296 -0.385764 -0.384271 -0.385216 -0.382300 -0.372086 -0.372619 -0.368931 -0.353449 -0.396148 -0.356605 -0.480737 -0.696551 -0.099998 -0.252151 -0.106416 0.193681 0.193027 0.193734 0.193895 0.195125 0.194424 0.192176 0.191562 0.191354 0.191535 0.189860 0.189620 0.193182 0.210880 0.187635 0.187396 0.198988 0.211309 0.194866 0.195044 0.218410 0.221764 0.209550 0.209530 0.215263 0.220629 0.264096 0.156003
chargesum: 0.00000
title: Mulliken charges with hydrogens summed into heavy atoms:
elementType: O C C C C C C C C C C C C C C C
charge: -0.211296 0.000944 0.003358 0.004333 0.001438 0.010803 0.006861 0.035131 0.021582 0.014149 0.033306 -0.040563 -0.062208 0.120630 0.011944 0.049587
polarizability: 2.03159672e+02 -1.68395003e+01 1.75836742e+02 3.37556879e+00 -5.36454371e+00 1.35458404e+02
1716.lowfreq: -8.6884 -2.7588 -0.0011 -0.0006 0.0006 9.9636 15.3046 21.5344 35.3176
frequency: 15.2646 21.4341 34.9954 40.3175 51.5409 66.3934 79.8885 91.5380 101.2539 111.9903 130.8889 139.7111 142.0334 152.9722 160.4118 171.2199 191.2234 229.1563 257.4738 264.9452 303.1700 367.2209 383.8457 433.0459 449.6576 477.8936 498.3892 558.7820 718.3769 720.2306 724.7895 736.2965 760.0806 787.0304 808.9595 854.0398 881.2778 887.3279 906.6733 951.4799 972.5633 976.1719 984.0794 998.8556 1001.6890 1016.4679 1023.9292 1034.5428 1056.1314 1063.4698 1078.8481 1080.6379 1082.3953 1089.1489 1117.5227 1122.6433 1161.6682 1175.4753 1182.6428 1202.4634 1212.9664 1228.3062 1240.8351 1248.4167 1261.8971 1269.5414 1277.4939 1278.1044 1283.7116 1285.0284 1290.8517 1292.3319 1294.1805 1295.8516 1318.8298 1323.7120 1339.0533 1351.7068 1353.8536 1356.1086 1358.3628 1382.9944 1389.3258 1450.9648 1459.2793 1459.6417 1461.8031 1463.0738 1464.4305 1467.3481 1472.3832 1476.5693 1477.7360 1482.6032 1486.5488 1488.9676 1604.1588 1648.4304 2852.4994 2947.6803 2948.1305 2949.4061 2950.5407 2952.1577 2954.0544 2956.3390 2960.1726 2963.6660 2967.5348 2970.7051 2971.2613 2981.1858 2983.9352 2988.1578 2994.5521 3002.7564 3010.6148 3019.9453 3028.1043 3033.2570 3039.6320 3044.7555 3060.6248 3067.8359 3069.8167 3130.6207
redmass: 4.6868 4.3284 2.6765 2.2194 3.0823 1.5497 2.7805 3.2241 1.6710 2.3100 1.8591 4.1868 2.2657 1.9678 3.0661 3.3573 3.9499 1.1186 2.8903 2.3241 3.4185 3.1611 3.2394 3.0163 2.6816 3.2044 3.0038 3.2795 1.0583 1.0676 1.0872 1.1231 1.1772 1.3089 1.3060 1.2894 1.8871 1.9022 1.3326 1.6082 1.6292 1.9821 3.7360 1.3627 1.9479 1.7579 2.3484 1.4541 2.6259 2.8232 2.4360 2.0495 2.3186 2.2524 2.8321 2.6364 2.0829 1.3734 1.7308 1.4792 1.3637 1.3882 1.3435 1.3454 1.3292 1.2862 1.2744 1.0183 1.1992 1.0781 1.1131 1.1221 1.1655 1.2397 1.3540 1.3405 1.4368 1.5580 1.6790 1.6573 1.6020 1.2540 1.2177 1.0990 1.0760 1.0746 1.0730 1.0733 1.0640 1.0840 1.0852 1.0441 1.0844 1.0896 1.0932 1.0949 7.8407 5.5864 1.0846 1.0588 1.0588 1.0592 1.0593 1.0596 1.0615 1.0601 1.0603 1.0596 1.0587 1.0606 1.0365 1.0962 1.0971 1.0986 1.1004 1.1016 1.1028 1.1038 1.1016 1.1010 1.1032 1.1028 1.0914 1.1006 1.0993 1.0927
irintensity: 0.7222 1.0958 0.5887 0.4853 0.7939 0.1429 1.6492 0.1416 0.3323 1.0298 0.0994 1.2274 0.8680 0.0466 2.9625 0.9573 1.8793 0.0038 4.0205 1.8932 2.1371 0.1686 1.2493 3.4085 1.7117 0.2478 0.8454 6.5370 19.1790 0.3238 5.6099 0.1129 1.6162 2.6735 3.3399 3.2989 3.8376 5.0608 0.6118 0.8849 12.7437 12.6065 1.0557 21.4977 11.5570 25.1162 0.1580 2.1393 4.9111 3.2361 1.2910 0.4108 2.1120 6.6695 23.9302 12.4072 27.8622 12.2828 1.2297 4.5633 9.0047 0.4817 0.1082 2.2901 0.3957 2.5402 0.0703 0.2052 0.8336 0.4524 0.1390 0.0777 0.2141 0.2878 0.0499 2.0308 0.2058 1.7408 0.1489 0.4058 2.0123 8.0073 11.2425 17.1611 0.2215 0.0018 0.3768 0.0062 0.2993 0.7470 0.7236 12.1916 1.6342 2.4838 3.3085 36.8179 144.5565 191.0959 109.4880 0.0720 0.3714 0.2967 0.5310 2.3805 15.0660 3.4951 11.2750 57.6856 158.5370 146.4655 40.7282 0.1226 0.2411 0.3196 0.1871 0.3812 1.4006 3.2199 6.4149 6.2275 66.0643 253.3830 55.6650 97.5739 55.6890 8.9452
temp: 298.150 k
press: 1.00000 atm
elementType: 8 6 6 6 6 6 6 6 6 6 6 6 6 6 6 6 1 1 1 1 1 1 1 1 1 1 1 1 1 1 1 1 1 1 1 1 1 1 1 1 1 1 1 1
symmnumber: 1
zpe: 1035857.9 jmol-1
zpe.correction: 0.394537 hartree
zpe.thermalcorrener: 0.415531 hartree
zpe.thermalcorrenthalpy: 0.416475 hartree
zpe.thermalcorrgfe: 0.340351 hartree
zpe.sumelectzpe: -662.280325 hartree
zpe.sumelectthermal: -662.259332 hartree
zpe.sumelectthermalent: -662.258388 hartree
zpe.sumelectthermalfe: -662.334512 hartree
dipole: 2.1431 -4.2472 0.8122
dipole: 4.8261
quadrupole: -129.4395 -114.8261 -98.3987
quadrupole: 29.4864 -5.9966 2.9427
quadrupole: -15.2181 -0.6047 15.8227 29.4864 -5.9966 2.9427
hfenergy: -662.6748629 hartree
pointgroup: C01 [X(C15H28O1)]
dipole: 0.8487508 1.656783 -0.3739152 debye
polarizability: 203.2698491|16.5824983|175.3283141|-4.1891529|-6.6384522|135.8566546 unknown
InChI: InChI=1S/C15H28O/c1-2-3-4-5-6-7-8-9-10-11-12-13-14-15-16/h13-15H,2-12H2,1H3
charge 0 multiplicity 1
44 atoms
O  -6.844335 -3.0353 0.224719
C  1.465841 0.968055 -0.179808
C  2.573511 -0.028909 0.22926
C  0.050213 0.514721 0.242996
C  3.992406 0.430298 -0.175888
C  -1.063318 1.492304 -0.1961
C  5.095584 -0.582398 0.206333
C  -2.47418 1.044807 0.247481
C  6.516529 -0.119664 -0.187606
C  -3.58729 2.008766 -0.219427
C  7.617102 -1.141107 0.180399
C  -5.007999 1.597147 0.263816
C  9.03404 -0.66939 -0.2122
C  -5.48147 0.297121 -0.333525
C  -5.950168 -0.785169 0.358177
C  -6.39754 -2.000462 -0.34391
H  1.68163 1.961036 0.267546
H  1.491466 1.11141 -1.280575
H  2.363734 -1.017293 -0.230897
H  2.539285 -0.185262 1.327949
H  -0.155237 -0.489074 -0.184173
H  0.018911 0.394111 1.346171
H  4.21105 1.408711 0.301232
H  4.021465 0.606415 -1.271794
H  -1.041898 1.59815 -1.301261
H  -0.850961 2.501032 0.216452
H  5.061125 -0.766947 1.300701
H  4.880761 -1.557626 -0.279112
H  -2.501927 0.962896 1.354326
H  -2.676838 0.026346 -0.141964
H  6.737581 0.849671 0.306776
H  6.549853 0.075024 -1.280265
H  -3.581278 2.073237 -1.327358
H  -3.371409 3.029521 0.154426
H  7.58047 -1.338148 1.271478
H  7.396669 -2.107992 -0.316744
H  -5.029589 1.540257 1.368734
H  -5.719752 2.397141 -0.033155
H  9.104885 -0.493222 -1.302327
H  9.290866 0.278794 0.297071
H  9.801413 -1.417531 0.059767
H  -5.442756 0.232251 -1.435298
H  -6.010235 -0.788653 1.454075
H  -6.313016 -1.950974 -1.461798
