program: Gaussian 09
title: 000149209
version: EM64L-G09RevD.01
frameworkgroup: C1[X(C8H9N5O2)]
method: RPBEPBE
basis: SDD
operation: Freq
keyword: #pfreq=noraman
keyword: PBEPBE/SDD
title: #p freq=noraman PBEPBE/SDD
converged: YES YES NO NO
title: Mulliken charges:
elementType: O O N N N N N C C C C C C C C H H H H H H H H H
charge: -0.214586 -0.214605 -0.119262 -0.119302 -0.051321 -0.051304 0.033351 -0.402388 -0.379386 -0.402420 -0.379386 0.146698 0.146694 0.089277 -0.366812 0.244492 0.262365 0.254597 0.257133 0.244490 0.262358 0.254639 0.257109 0.247569
chargesum: 0.00000
title: Mulliken charges with hydrogens summed into heavy atoms:
elementType: O O N N N N N C C C C C C C C
charge: -0.214586 -0.214605 -0.119262 -0.119302 -0.051321 -0.051304 0.033351 0.104468 0.132344 0.104429 0.132362 0.146698 0.146694 0.089277 -0.119242
polarizability: 2.04966176e+02 -9.74191649e-04 1.44934188e+02 3.79151442e+00 -6.06792329e-03 6.97058127e+01
1716.lowfreq: -10.7531 -3.1463 0.0007 0.0008 0.0011 3.7948 32.3637 34.6391 81.8157
frequency: 32.3166 34.5794 81.8076 98.0729 150.1158 152.0347 164.5121 197.5473 221.0529 237.9009 273.7676 335.5739 368.6255 426.9106 458.0394 491.1288 529.1127 588.9710 662.4523 681.1388 712.0101 767.3020 781.7424 782.3242 787.7172 800.2875 892.5033 915.6844 922.0174 953.4879 992.6294 995.5561 1009.0025 1031.1808 1101.8917 1103.3369 1110.3645 1110.4552 1116.3918 1121.2054 1136.0624 1137.1083 1174.6869 1181.5923 1209.9923 1278.2474 1288.6140 1343.6609 1378.7441 1441.1272 1448.6728 1461.0386 1461.5158 1476.6981 1481.8458 1523.4021 1531.4131 3087.7487 3087.8269 3101.7408 3101.9400 3153.5029 3191.9402 3191.9513 3213.0680 3213.0766
redmass: 13.6135 5.0058 2.6161 2.6311 4.2808 4.6144 3.2181 5.1533 6.5237 6.2235 6.0820 8.6123 4.9483 7.2584 5.5268 4.7842 6.4733 6.3130 10.5212 11.1137 10.6631 5.9452 1.0944 1.0326 6.7001 9.9807 5.1809 6.4100 4.8768 1.4715 1.4122 1.2100 1.9328 5.2110 1.3431 1.3148 1.3679 1.3586 1.3977 1.5037 1.4708 1.4395 3.9132 4.5375 8.1893 8.6200 6.7891 6.7536 1.6169 8.4839 2.4739 1.0787 1.0972 1.2095 1.4751 10.1451 9.2946 1.0513 1.0512 1.0580 1.0581 1.0921 1.1188 1.1188 1.1179 1.1179
irintensity: 1.1288 6.5900 5.2864 4.5066 18.5372 4.3811 0.4477 6.0962 1.7128 0.5377 28.7568 0.1217 0.3347 3.2531 14.7858 8.5562 0.0687 6.7121 8.7461 3.8779 5.2933 24.4898 57.7984 1.8452 6.8798 19.9311 0.9071 10.7375 13.6912 10.2959 10.8236 1.5633 67.6515 1.5616 1.6470 6.2519 3.5385 14.9601 0.2173 53.7920 10.1307 0.7186 24.1984 48.6459 174.9942 12.9734 159.2996 31.8947 12.5037 173.8113 4.6301 12.5802 3.3923 5.1823 47.5681 41.9550 1425.7266 28.8249 7.5384 45.5259 6.1077 21.7065 1.1395 4.0419 4.9457 26.4585
temp: 298.150 k
press: 1.00000 atm
elementType: 8 8 7 7 7 7 7 6 6 6 6 6 6 6 6 1 1 1 1 1 1 1 1 1
symmnumber: 1
zpe: 457511.6 jmol-1
zpe.correction: 0.174257 hartree
zpe.thermalcorrener: 0.187592 hartree
zpe.thermalcorrenthalpy: 0.188536 hartree
zpe.thermalcorrgfe: 0.132907 hartree
zpe.sumelectzpe: -733.163208 hartree
zpe.sumelectthermal: -733.149873 hartree
zpe.sumelectthermalent: -733.148929 hartree
zpe.sumelectthermalfe: -733.204558 hartree
dipole: -0.0010 1.6360 0.0008
dipole: 1.6360
quadrupole: -64.2603 -96.8593 -85.5584
quadrupole: -0.0016 -2.4013 -0.0030
quadrupole: 17.9657 -14.6333 -3.3324 -0.0016 -2.4013 -0.0030
hfenergy: -733.3374649 hartree
pointgroup: C01 [X(C8H9N5O2)]
dipole: -0.0003637 0.6436658 0.0005198 debye
dipolederiv: -0.616625 -0.2640658 0.1791546 -0.2392435 -0.6499178 0.0774562 0.2203662 0.0528706 -0.290257 -0.6168694 0.263704 0.1792743 0.238989 -0.649856 -0.0777165 0.2209293 -0.0536184 -0.2904467 -1.8317419 -0.2506172 0.0263878 -0.8057476 -0.2594565 -0.1680947 -0.4943361 -0.1513849 -0.4252465 -1.8317896 0.250915 0.0264367 0.8062558 -0.2597909 0.1681483 -0.4936002 0.1515001 -0.4253941 -1.0125708 -0.1454815 -0.0731712 -0.7740221 -0.8221799 -0.0907688 -0.0772367 -0.0068607 -0.2240419 -1.0123737 0.1456192 -0.0730715 0.7741226 -0.8223028 0.090465 -0.0773789 0.0067031 -0.2240548 0.8543147 0.000373 -0.4431955 0.0001667 1.5393317 0.0005815 -0.4667556 0.0008492 0.3416219 0.3950885 -0.0408495 0.0632583 0.0574885 0.0330818 0.0507515 0.0168469 0.0334599 0.2354088 0.5651598 0.1255034 -0.0449441 0.2663825 0.2340049 0.0736253 0.0302095 0.0649206 0.2541305 0.3950156 0.0408007 0.0632966 -0.0575523 0.0330543 -0.0508074 0.0167829 -0.0335715 0.2353908 0.5652708 -0.1255684 -0.044939 -0.2664629 0.2342418 -0.0736092 0.0300846 -0.0648768 0.2541007 1.7395694 0.0220506 0.1993133 0.7059377 0.6730535 0.1232432 0.5238113 0.1913711 0.2382479 1.7396348 -0.0224038 0.1995306 -0.7063125 0.6733242 -0.1230973 0.5235198 -0.1913033 0.238133 -0.9851612 0.0000244 -0.0495842 0.0000372 -0.8036573 -0.0003191 -0.1441296 -0.0002132 -0.0500644 1.3068339 -0.0001392 0.1778633 -0.0000895 0.7202984 0.0000869 0.2501641 0.0002375 0.0227698 -0.0131434 0.0284477 -0.0739547 0.099296 0.0815453 0.007399 -0.1227566 0.0164269 -0.0164889 0.0301285 0.0095032 -0.0444298 0.0670919 0.0133844 -0.0811831 0.0578624 -0.0743652 0.0316523 0.0072131 -0.0286548 -0.0608349 -0.0283302 0.0553015 0.0123644 0.0562492 0.0327026 -0.0590822 0.1098232 -0.0230702 -0.0139473 -0.131127 -0.0390389 -0.0314368 -0.0159706 -0.0447477 0.042283 -0.0132442 -0.0284402 -0.0740014 -0.0992694 0.0815821 -0.0073376 -0.1228119 -0.016371 -0.0164357 0.0301327 -0.0094488 -0.0444435 -0.0670775 0.0133378 0.0812079 0.0578529 0.0743618 0.0317068 0.0072681 0.0286617 -0.0608781 0.0283467 0.0552947 -0.0123442 0.0561766 -0.0326494 -0.0589862 0.1097689 0.023125 -0.0139613 0.131123 -0.0390976 0.0314087 -0.0159587 0.0447386 0.0423025 0.0782973 0.0000114 0.0008409 -0.000003 -0.095539 -0.0000232 -0.029921 -0.0001798 0.11275 unknown
polarizability: 204.6567331|-0.0069121|144.9341837|7.4923398|0.0196211|70.0152602 unknown
InChI: InChI=1S/C8H9N5O2/c14-13(15)6-7(11-1-2-11)9-5-10-8(6)12-3-4-12/h5H,1-4H2
charge 0 multiplicity 1
24 atoms
O  -1.056665 -2.158413 0.419533
O  1.056763 -2.157776 -0.421851
N  -2.438881 0.095841 -0.479773
N  2.438938 0.095436 0.480276
N  -1.204403 2.047112 -0.177083
N  1.204593 2.046963 0.178313
N  0.000118 -1.534964 -0.000512
C  -3.774583 0.688313 -0.260894
C  -3.427447 -0.70939 0.272917
C  3.774656 0.687772 0.261014
C  3.427127 -0.709733 -0.273029
C  -1.223496 0.665799 -0.174057
C  1.223533 0.665655 0.175086
C  0.000023 -0.080156 0.000248
C  0.000155 2.64405 0.000464
H  -4.398847 0.784666 -1.155039
H  -3.833382 1.523541 0.445147
H  -3.259442 -0.827855 1.347828
H  -3.796669 -1.601989 -0.238951
H  4.399297 0.783819 1.154925
H  3.833279 1.523166 -0.444844
H  3.258732 -0.827899 -1.347911
H  3.796536 -1.602474 0.23846
H  0.000167 3.739114 0.000933
