program: Gaussian 09
title: 000149212
version: EM64L-G09RevD.01
frameworkgroup: C1[X(C18H14O3)]
method: RPBEPBE
basis: SDD
operation: Freq
keyword: #pfreq=noraman
keyword: PBEPBE/SDD
title: #p freq=noraman PBEPBE/SDD
converged: YES YES NO NO
title: Mulliken charges:
elementType: O O O C C C C C C C C C C C C C C C C C C H H H H H H H H H H H H H H
charge: -0.257477 -0.390670 -0.421960 -0.096629 -0.278815 -0.189996 0.383463 -0.362446 0.275335 0.199907 -0.421408 0.479370 -0.498395 -0.620702 -0.706884 0.417722 0.399606 -0.438021 -0.419961 -0.244093 -0.242498 0.226616 0.235937 0.190375 0.203157 0.244016 0.333086 0.244650 0.334862 0.232758 0.247619 0.240781 0.242509 0.228760 0.229428
chargesum: 0.00000
title: Mulliken charges with hydrogens summed into heavy atoms:
elementType: O O O C C C C C C C C C C C C C C C C C C
charge: -0.257477 -0.057585 -0.087098 0.129987 -0.042878 0.000380 0.383463 -0.159289 0.275335 0.199907 -0.177392 0.479370 -0.253745 -0.387945 -0.459265 0.417722 0.399606 -0.197240 -0.177452 -0.015333 -0.013069
polarizability: 3.48927933e+02 -2.66059310e+01 2.16367159e+02 -1.23401079e+01 -2.66758513e+00 1.02435665e+02
1716.lowfreq: -4.1531 0.0006 0.0007 0.0008 5.6043 11.0637 40.8947 43.2222 70.4546
frequency: 40.7413 43.1987 70.4460 106.8969 127.9310 146.9927 193.2209 225.1164 229.9770 248.4674 261.9326 283.4383 290.1238 308.3111 335.7131 398.5376 413.1718 432.5846 456.9410 469.3463 482.2527 496.9530 540.8544 548.9171 572.3779 612.4270 618.3204 627.0959 654.4193 688.9041 718.0788 735.4683 753.2529 775.4041 777.4891 809.5427 825.4759 832.8212 847.4515 857.1157 866.6675 893.8272 897.0457 927.8765 947.0442 955.0704 966.5925 979.8785 984.0510 990.0522 1010.4540 1014.1264 1065.8953 1073.4349 1095.0111 1130.6948 1165.8138 1172.2334 1174.6065 1192.1866 1203.5539 1212.8616 1228.7175 1240.3516 1268.5883 1277.2151 1290.8902 1300.4071 1303.0318 1338.0365 1350.8775 1378.7968 1402.8459 1407.7341 1418.0167 1425.8188 1438.3951 1446.7733 1465.7918 1490.9529 1555.1720 1567.0520 1590.8715 1631.2887 1637.7370 2913.4048 2937.0922 3098.9978 3116.9973 3118.4678 3119.5094 3123.9181 3124.8816 3139.1082 3143.0790 3148.1548 3162.1125 3516.3187 3539.1261
redmass: 4.9265 6.1707 4.6035 5.4348 5.7441 5.4552 5.6107 1.4596 2.8893 4.4621 5.2913 1.2051 3.7947 5.1511 5.1721 3.6937 5.2358 5.2795 4.4750 2.5142 5.2062 5.2115 3.6624 6.3388 4.2877 6.3070 5.2825 6.3020 6.0822 5.3878 4.7976 4.1486 1.2982 4.5183 2.7446 2.4957 1.6724 4.1453 4.8390 1.6067 3.2188 1.6931 4.5517 2.1208 3.7541 5.4687 1.4110 1.4293 2.2826 1.3566 3.6282 2.3034 1.7561 1.5874 1.8788 1.7134 1.2224 1.0886 1.4441 1.3290 1.5311 1.3193 1.5610 1.1947 1.7082 2.3841 1.4421 1.6020 1.5763 1.9616 1.4101 1.9654 4.2266 2.3102 2.4507 2.4743 7.8728 3.4164 2.9642 3.3661 5.7023 8.5564 5.6256 6.9999 6.6571 1.0830 1.0834 1.0872 1.0938 1.0900 1.0872 1.0868 1.0883 1.0899 1.0950 1.0981 1.1003 1.0658 1.0660
irintensity: 0.7931 0.7852 1.1637 2.1536 0.7571 3.9891 1.8186 80.8244 54.4286 0.6546 11.2882 146.8325 25.5535 14.9051 3.1513 1.9323 2.9895 10.9881 4.5273 21.1347 10.5677 4.5642 2.3906 1.0638 8.0081 0.3346 5.6087 11.7669 23.1446 10.0820 20.3921 7.5479 62.5556 0.8821 1.5798 8.2706 11.5316 6.6615 23.3642 0.5043 22.3086 41.5609 6.7144 28.6730 6.5343 53.4681 10.9076 9.3809 22.3960 0.0615 30.5353 4.7998 17.0167 2.7275 6.1148 4.1211 32.6450 5.4926 78.2870 6.4047 10.1781 6.1355 1.8395 1.4306 0.8213 2.7390 1.9131 3.0705 1.2339 1.6843 12.6020 2.0427 3.7647 13.3306 5.4064 7.1488 0.8664 2.3707 0.1049 4.1754 11.0613 2.8015 0.0858 5.4001 1.0933 86.5712 46.3920 11.3706 60.9655 2.7013 8.1908 3.0899 2.8455 5.7570 35.8126 27.7382 44.2330 7.8612 4.7646
temp: 298.150 k
press: 1.00000 atm
elementType: 8 8 8 6 6 6 6 6 6 6 6 6 6 6 6 6 6 6 6 6 6 1 1 1 1 1 1 1 1 1 1 1 1 1 1
symmnumber: 1
zpe: 708388.0 jmol-1
zpe.correction: 0.269811 hartree
zpe.thermalcorrener: 0.286283 hartree
zpe.thermalcorrenthalpy: 0.287227 hartree
zpe.thermalcorrgfe: 0.225987 hartree
zpe.sumelectzpe: -918.480873 hartree
zpe.sumelectthermal: -918.464401 hartree
zpe.sumelectthermalent: -918.463457 hartree
zpe.sumelectthermalfe: -918.524697 hartree
dipole: 1.9424 -2.6387 1.7231
dipole: 3.7020
quadrupole: -116.5293 -94.7864 -133.2860
quadrupole: 8.2821 -14.4660 1.6204
quadrupole: -1.6621 20.0809 -18.4188 8.2821 -14.4660 1.6204
hfenergy: -918.7506839 hartree
pointgroup: C01[X(C18H14O3)]
dipole: 0.7832375 -1.0323829 0.6648308 debye
polarizability: 350.0106115|-23.7255084|215.4096693|-11.9916989|-1.3164931|102.3104757 unknown
InChI: InChI=1S/C18H14O3/c19-15-14-12(17-18(21-17)16(15)20)6-5-11-7-9-3-1-2-4-10(9)8-13(11)14/h1-8,15-20H
charge 0 multiplicity 1
35 atoms
O  -4.341437 0.625646 -0.901905
O  -3.235162 -1.74852 -1.761185
O  -1.847226 -1.825803 1.746249
C  -4.191846 -0.498615 0.084826
C  -3.592684 0.828285 0.420472
C  -3.256905 -1.648911 -0.298692
C  -2.121905 1.025157 0.293919
C  -1.830373 -1.478648 0.301001
C  -1.258886 -0.074282 0.217992
C  0.172926 0.135915 0.116241
C  -1.608995 2.367621 0.243203
C  0.6810 1.505744 0.04245
C  -0.249862 2.601904 0.108479
C  1.114546 -0.924878 0.106408
C  2.073126 1.735885 -0.074125
C  2.508608 -0.696132 -0.003174
C  3.005074 0.671703 -0.106088
C  3.460501 -1.778666 -0.015519
C  4.424435 0.891303 -0.22454
C  4.824547 -1.529736 -0.130286
C  5.312388 -0.179593 -0.237465
H  -5.140959 -0.787373 0.551158
H  -4.126021 1.496833 1.108261
H  -3.672409 -2.586078 0.140702
H  -1.170702 -2.190671 -0.242579
H  -2.315177 3.20387 0.297867
H  -2.643223 -2.502152 -2.01904
H  0.137434 3.62614 0.057784
H  -2.110234 -2.778847 1.846384
H  0.77321 -1.96037 0.208851
H  2.43634 2.769681 -0.134425
H  3.089748 -2.807561 0.066498
H  4.793595 1.920922 -0.303011
H  5.538234 -2.360826 -0.139741
H  6.389793 -0.003046 -0.32777
