program: Gaussian 09
title: 000149194
version: EM64L-G09RevD.01
frameworkgroup: C1[X(C5H8FN7)]
method: RPBEPBE
basis: SDD
operation: Freq
keyword: #pfreq=noraman
keyword: PBEPBE/SDD
title: #p freq=noraman PBEPBE/SDD
converged: YES YES NO NO
title: Mulliken charges:
elementType: F N N N N N N N C C C C C H H H H H H H H
charge: -0.198946 -0.158580 -0.130149 -0.020470 -0.391228 -0.632214 -0.657980 -0.499636 0.187840 0.094925 -0.390713 0.231937 0.018381 0.254550 0.310161 0.421172 0.297447 0.328500 0.332983 0.300308 0.301713
chargesum: 0.00000
title: Mulliken charges with hydrogens summed into heavy atoms:
elementType: F N N N N N N N C C C C C
charge: -0.198946 -0.158580 -0.130149 -0.020470 -0.081066 0.029268 0.060639 0.102385 0.187840 0.094925 -0.136163 0.231937 0.018381
polarizability: 2.08535404e+02 6.78992935e+00 1.11789582e+02 2.51642472e-01 -7.22540208e-02 4.74779471e+01
1716.lowfreq: -75.8360 -14.2879 -5.9079 -2.1027 -0.0006 0.0001 0.0008 55.5462 69.3930
frequency: -75.7350 55.3949 69.3781 120.3681 139.2644 167.3903 202.9470 247.9693 268.0132 316.6519 361.2714 388.2798 398.7299 433.1869 448.8100 475.7079 481.5481 489.8242 524.4304 558.5069 630.9240 638.4576 684.1407 723.3283 735.1924 797.7219 808.5751 832.0571 886.6774 914.5337 979.0732 998.1514 1066.7416 1137.6594 1232.9600 1234.8769 1288.5730 1298.2667 1321.1342 1383.4432 1386.8467 1451.0765 1484.9106 1504.9207 1542.3587 1583.9434 1624.7383 1635.5356 1692.5115 3172.9523 3278.7210 3383.5095 3490.3234 3560.7374 3577.7733 3617.8757 3716.3322
redmass: 1.1548 4.9390 4.6374 5.3770 4.6956 4.7421 4.8947 6.6960 4.0975 4.9732 1.5095 1.2112 2.5528 4.3171 1.2797 4.0790 3.8994 1.2786 9.3960 4.5526 6.9429 5.2461 5.4628 8.5444 6.0065 2.6688 1.1699 3.3626 1.4368 5.8379 2.1243 3.8278 1.7733 3.4430 3.5380 5.4884 1.5697 1.1517 3.2551 7.3572 1.8942 7.7414 3.9131 3.4648 1.6358 1.6546 2.4981 2.9335 1.0620 1.0928 1.0629 1.0431 1.0978 1.0444 1.0790 1.0899 1.1053
irintensity: 12.7906 1.1119 5.8685 1.3883 6.3284 2.8782 9.4583 0.8967 10.7886 0.8153 6.0110 263.0513 5.5670 8.1835 6.3827 21.3541 96.3275 326.5808 7.4178 6.4266 23.6891 0.0401 7.4576 8.3589 10.4600 204.0345 114.2754 29.8175 22.8967 2.5325 6.1122 1.0883 6.6810 164.1647 13.5102 94.3128 1.5906 0.2424 11.9863 26.1090 39.8513 421.7722 423.7844 99.9518 418.9982 71.5904 716.6687 507.8370 22.2778 8.9631 165.1703 1.0236 0.9891 168.1478 63.4873 51.4674 48.5308
temp: 298.150 k
press: 1.00000 atm
elementType: 9 7 7 7 7 7 7 7 6 6 6 6 6 1 1 1 1 1 1 1 1
symmnumber: 1
zpe: 403412.0 jmol-1
zpe.correction: 0.153652 hartree
zpe.thermalcorrener: 0.165784 hartree
zpe.thermalcorrenthalpy: 0.166728 hartree
zpe.thermalcorrgfe: 0.115377 hartree
zpe.sumelectzpe: -677.452397 hartree
zpe.sumelectthermal: -677.440264 hartree
zpe.sumelectthermalent: -677.439320 hartree
zpe.sumelectthermalfe: -677.490671 hartree
dipole: 0.3652 1.6077 0.0686
dipole: 1.6501
quadrupole: -58.5908 -71.9435 -76.7660
quadrupole: 7.8640 0.2910 -0.0458
quadrupole: 10.5093 -2.8434 -7.6659 7.8640 0.2910 -0.0458
hfenergy: -677.6060482 hartree
pointgroup: C01[X(C5H8F1N7)]
dipole: 0.1407094 0.4578328 -0.4382351 debye
dipolederiv: -0.518759 0.2299095 -0.2563269 0.4051279 -0.5303324 0.3768672 -0.4415541 0.3711474 -0.5995265 -2.2699952 -0.2894523 0.2291227 -0.7260682 -0.5335008 0.1972507 0.7189554 0.2153317 -0.513057 -0.5247827 -0.1290804 0.1218153 0.1264741 -0.2377745 0.0573386 -0.1462679 0.0500598 -0.2454723 -0.2596052 -0.2452894 0.2602964 0.1365351 -0.2051258 -0.0529428 -0.1430717 -0.066246 -0.1941279 -1.5221712 0.0631832 -0.1619789 -0.1892074 -0.3077007 -0.2390999 -0.0025026 -0.2450919 -0.2148917 -2.0022197 -0.0813045 0.0416487 -0.0674822 -0.4416889 -0.324258 0.0344525 -0.3245415 -0.4028161 -0.5960792 0.1647045 -0.1475687 -0.2221436 -0.8375154 0.2084724 0.2659335 0.2348774 -0.9041105 -0.5854599 0.0273066 -0.0164022 -0.1419245 -0.0401659 0.0150853 0.1851177 0.0080687 -0.0293001 1.9941629 0.1263624 -0.0605652 0.2735927 0.0132407 0.1030946 -0.225918 0.0930114 -0.0048773 2.0391485 0.0241717 0.039118 0.4481873 -0.0329274 0.2440901 -0.4133755 0.2276948 -0.0749977 -0.2716182 0.1823676 -0.2012284 -0.4179599 0.0750748 -0.1831526 0.4336292 -0.1619934 0.1027519 2.3930688 0.0440416 0.0578825 0.9811579 0.8270952 -0.5683569 -0.9299762 -0.5959964 0.8347042 0.0696121 -0.047592 0.0475473 -0.8659087 0.6086402 -0.4939005 0.9138087 -0.4635683 0.7004106 0.0460622 0.0457288 -0.0513776 0.0558538 0.0745498 0.0744521 -0.0619601 0.0740666 0.0625003 0.2155901 0.0161768 -0.0109704 0.1078644 0.2189799 0.1592648 -0.025103 0.165915 0.1643312 0.4380181 0.0704975 -0.0703241 0.0883627 0.2960074 0.0510964 -0.0939704 0.0482963 0.2969914 0.122469 -0.0590117 0.0380311 -0.0467414 0.2749351 0.114138 0.0123585 0.1013763 0.290547 0.2424645 0.0187014 -0.0251456 0.059878 0.2926066 0.1072529 -0.0717896 0.1053328 0.2788683 0.2889394 -0.0185076 0.015173 -0.0761643 0.2867323 0.127248 0.0748176 0.1295783 0.2754036 0.3590758 0.0408131 0.1764459 0.1193966 0.1234627 0.0156295 0.0307353 0.000012 0.0529551 0.3420789 -0.1837269 -0.0251929 -0.0488303 0.0754071 0.0104297 -0.1143194 0.0326693 0.1237134 unknown
polarizability: 208.3654542|8.110683|78.1304862|-2.135884|-32.080925|81.306993 unknown
InChI: InChI=1S/C5H8FN7/c6-3-4(7)10-1-2(11-3)12-5(8)13-9/h1,13H,7-9H2
charge 0 multiplicity 1
21 atoms
F  -2.417523 1.168368 -1.734072
N  1.6621 -0.490211 0.16633
N  -0.412019 0.36805 -0.81393
N  -1.857841 -1.316039 0.919494
N  3.83598 0.140946 -0.394827
N  -3.899225 -0.515782 0.003092
N  2.044896 1.168375 -1.549444
N  4.403248 -0.752718 0.544654
C  0.281654 -0.452724 0.080719
C  -2.51797 -0.501767 0.035079
C  -0.502229 -1.289348 0.938166
C  2.460551 0.269122 -0.589507
C  -1.734373 0.325095 -0.814319
H  0.004718 -1.945695 1.649525
H  4.500805 0.623572 -0.997125
H  1.019429 1.236524 -1.670804
H  2.694518 1.751924 -2.072032
H  -4.389998 -1.138243 0.6399
H  -4.410777 0.077399 -0.643239
H  4.140615 -0.471295 1.500643
H  4.06374 -1.710454 0.369096
