program: Gaussian 09
title: 000149205
version: EM64L-G09RevD.01
frameworkgroup: C1[X(C22H14O2)]
method: RPBEPBE
basis: SDD
operation: Freq
keyword: #pfreq=noraman
keyword: PBEPBE/SDD
title: #p freq=noraman PBEPBE/SDD
converged: NO YES NO NO
title: Mulliken charges:
elementType: O O C C C C C C C C C C C C C C C C C C C C C C H H H H H H H H H H H H H H
charge: -0.437749 -0.485175 0.228656 0.245339 0.485910 0.504959 0.290720 -0.667519 -0.690855 0.191910 0.253015 0.417432 -0.497791 -0.511270 -0.436879 -0.480105 -0.404044 -0.029789 -0.367216 -0.435167 -0.376640 0.127936 -0.259854 -0.251190 0.228535 0.232981 0.242484 0.240806 0.274486 0.233741 0.225763 0.224749 0.238982 0.221678 0.227260 0.228743 0.390166 0.374994
chargesum: 0.00000
title: Mulliken charges with hydrogens summed into heavy atoms:
elementType: O O C C C C C C C C C C C C C C C C C C C C C C
charge: -0.047584 -0.110182 0.228656 0.245339 0.485910 0.504959 0.290720 -0.438985 -0.457874 0.191910 0.253015 0.417432 -0.255307 -0.270464 -0.162393 -0.246364 -0.178281 -0.029789 -0.142468 -0.196185 -0.154962 0.127936 -0.032594 -0.022447
polarizability: 5.52862736e+02 -1.08492819e+01 2.59935014e+02 4.19458371e-04 -2.08026788e-03 9.10474277e+01
1716.lowfreq: -5.3377 -0.0013 -0.0008 -0.0005 5.5612 8.9435 32.6149 49.2315 92.8630
frequency: 32.6147 49.2300 92.8625 106.8325 114.7468 163.7752 175.4056 195.3212 231.9793 250.7464 252.2099 287.2008 288.1990 290.5644 363.5363 367.6542 397.1056 421.7351 435.1515 452.7565 460.7076 479.6639 490.4280 507.6180 523.7701 529.2856 543.1693 550.5657 591.3825 595.3601 604.1821 632.6789 672.3770 691.3433 702.2615 726.0806 735.6648 756.8474 757.0815 766.9856 803.1779 816.7629 819.3787 827.8220 835.6842 871.3165 877.1830 886.3404 904.4478 915.2553 931.0621 933.9487 956.5641 981.4397 984.2757 991.1529 993.0553 1038.8537 1058.1353 1106.0068 1122.7374 1155.0789 1158.5629 1177.7162 1198.4904 1215.2049 1226.5519 1228.3490 1233.2334 1238.5372 1261.6745 1270.9138 1296.4309 1301.8796 1319.5904 1363.8420 1391.8300 1400.6573 1406.5754 1419.1886 1433.8399 1449.6274 1454.7998 1460.3025 1487.0438 1500.9728 1518.6631 1560.0795 1572.0781 1605.3278 1618.9777 1623.9691 1628.7471 1637.2414 3115.9314 3119.6827 3120.5071 3126.0422 3129.1419 3132.9486 3136.4347 3141.6312 3148.6568 3163.2791 3165.3431 3172.4921 3524.3613 3625.8331
redmass: 6.0851 4.9813 5.0116 5.9308 5.3472 5.1250 4.3682 6.4335 3.2614 1.2141 7.0558 5.0757 3.8630 5.7297 5.4076 4.8006 3.1536 6.9568 3.0273 5.6676 7.0877 3.1640 1.1093 6.4204 4.9344 3.3159 6.6388 3.1164 3.6522 6.1632 4.2181 6.1119 7.0191 3.5282 6.8281 5.9933 2.8211 5.9992 1.2999 1.6049 1.9219 2.2091 5.6356 1.8739 1.6213 4.2664 5.9180 1.7149 1.5846 1.4131 2.1287 4.3304 1.4052 1.3899 3.7511 1.3813 1.3566 2.3499 3.0306 2.1953 1.3899 1.3263 1.2629 1.0823 1.7048 1.6786 1.6408 1.7234 1.8655 2.5742 1.7566 1.8805 1.6445 2.1655 3.4142 3.8833 3.9558 6.8568 2.9959 2.5204 3.2935 3.8423 3.0482 3.0370 3.4752 3.9798 4.3684 5.7951 7.7854 5.8598 6.6781 6.6531 6.6917 7.2060 1.0859 1.0892 1.0861 1.0893 1.0891 1.0902 1.0911 1.0978 1.0929 1.1000 1.0929 1.0954 1.0649 1.0667
irintensity: 0.9945 0.1353 0.0387 0.8977 1.0187 0.2573 0.7879 0.2657 54.4095 130.0005 6.0853 6.6997 0.0290 0.2238 7.7150 0.0330 1.6706 4.2604 16.2844 4.0152 2.1164 0.4629 131.9858 1.4840 0.7106 0.0049 0.0798 6.0157 0.2699 2.5543 0.9895 4.1614 11.3610 20.5668 4.6688 1.9212 2.0686 0.2694 43.4633 44.7308 4.0767 0.7668 18.1060 62.1085 5.5382 20.3028 72.8537 0.0027 40.5800 43.3434 2.6040 116.8047 8.1743 0.0096 51.5086 0.0674 0.0346 22.3083 25.1179 11.2243 84.2236 5.5808 4.4682 0.9952 16.3967 0.1303 9.6872 39.2614 267.4443 26.4354 132.8995 83.8462 6.6173 9.1350 18.1672 7.5319 4.8829 6.5023 1.9159 5.2522 15.7826 2.7680 21.9710 50.3779 99.3395 0.3356 4.6500 2.6100 8.2545 9.8714 15.0309 22.6295 5.0188 41.8789 0.1963 21.0971 3.8167 7.2494 14.5198 2.6135 1.2145 33.3445 35.1419 46.6164 12.4379 7.0380 129.1259 102.9258
temp: 298.150 k
press: 1.00000 atm
elementType: 8 8 6 6 6 6 6 6 6 6 6 6 6 6 6 6 6 6 6 6 6 6 6 6 1 1 1 1 1 1 1 1 1 1 1 1 1 1
symmnumber: 1
zpe: 763097.5 jmol-1
zpe.correction: 0.290648 hartree
zpe.thermalcorrener: 0.308311 hartree
zpe.thermalcorrenthalpy: 0.309256 hartree
zpe.thermalcorrgfe: 0.245733 hartree
zpe.sumelectzpe: -995.639732 hartree
zpe.sumelectthermal: -995.622069 hartree
zpe.sumelectthermalent: -995.621125 hartree
zpe.sumelectthermalfe: -995.684647 hartree
dipole: -1.5429 2.5451 0.0003
dipole: 2.9763
quadrupole: -102.7180 -118.1276 -147.9908
quadrupole: -15.9647 -0.0013 -0.0002
quadrupole: 20.2275 4.8178 -25.0453 -15.9647 -0.0013 -0.0002
hfenergy: -995.9303805 hartree
pointgroup: C01 [X(C22H14O2)]
dipole: -0.6055687 1.0022106 0.0001036 debye
polarizability: 552.8305457|-11.2754264|259.9672043|0.0004164|-0.0020809|91.0474277 unknown
InChI: InChI=1S/C22H14O2/c23-21-10-9-17-18(22(21)24)8-7-15-11-19-14(12-20(15)17)6-5-13-3-1-2-4-16(13)19/h1-12,23-24H
charge 0 multiplicity 1
38 atoms
O  -5.406855 -1.733382 0.000055
O  -6.597543 0.680762 0.000148
C  -0.887121 0.268051 0.000032
C  1.983817 -0.16633 0.000046
C  -0.327651 -1.071724 0.000008
C  1.424282 1.17284 0.000011
C  -2.346562 0.437948 0.000073
C  0.018423 1.353148 0.000012
C  1.078133 -1.251397 0.000019
C  3.444068 -0.333796 0.000099
C  -3.180289 -0.740545 0.000034
C  4.285652 0.838509 0.000022
C  -1.216251 -2.215311 -0.000036
C  2.31287 2.316544 -0.000053
C  -2.587007 -2.060356 -0.000032
C  3.682988 2.156738 -0.000065
C  -2.974028 1.718226 0.000156
C  -4.59728 -0.591038 0.000072
C  4.077182 -1.612925 0.000261
C  5.705852 0.690721 0.000062
C  -4.37231 1.847997 0.000195
C  -5.182839 0.688952 0.000151
C  5.474988 -1.738105 0.000293
C  6.300042 -0.578351 0.00018
H  -0.354805 2.382968 -0.000014
H  1.451782 -2.281013 -0.000015
H  -0.774269 -3.218709 -0.000082
H  1.870565 3.319939 -0.000088
H  -3.257188 -2.924346 -0.000076
H  4.345506 3.030617 -0.000134
H  -2.369636 2.628845 0.000206
H  3.469923 -2.523559 0.000378
H  6.329198 1.593214 -0.000008
H  -4.834732 2.8431 0.000254
H  5.932297 -2.733775 0.000418
H  7.390827 -0.679691 0.000197
H  -6.359377 -1.449981 0.000089
H  -6.975052 1.592019 0.000231
