program: Gaussian 09
title: 000149200
version: EM64L-G09RevD.01
frameworkgroup: C1[X(C13H6Cl6O2S)]
method: RPBEPBE
basis: SDD
operation: Freq
keyword: #p
keyword: freq=noraman
keyword: PBEPBE/SDD
title: #p freq=noraman PBEPBE/SDD
converged: YES YES NO NO
title: Mulliken charges:
elementType: Cl Cl Cl Cl Cl Cl S O O C C C C C C C C C C C C C H H H H H H
charge: 0.005679 0.001465 0.047475 0.036365 0.020349 0.022340 0.927251 -0.516922 -0.544885 0.407986 -0.036467 0.565289 -0.304452 -0.306433 -0.138659 -0.205004 -0.304842 -0.298918 -0.729328 -0.088474 -0.087436 -0.231090 0.285385 0.335802 0.270529 0.278104 0.297030 0.291863
chargesum: 0.00000
title: Mulliken charges with hydrogens summed into heavy atoms:
elementType: Cl Cl Cl Cl Cl Cl S O O C C C C C C C C C C C C C
charge: 0.005679 0.001465 0.047475 0.036365 0.020349 0.022340 0.927251 -0.516922 -0.544885 0.407986 -0.036467 0.565289 -0.304452 -0.021048 -0.138659 0.130798 -0.304842 -0.298918 0.116333 -0.088474 -0.087436 0.060773
polarizability: 3.15566555e+02 -2.40789925e+00 2.18835570e+02 1.24525260e+01 1.47006675e+00 1.76938587e+02
1716.lowfreq: -0.0012 0.0010 0.0024 1.6898 3.4067 5.9026 14.4768 25.6275 35.6836
frequency: 14.3448 25.6201 35.6833 54.6792 65.6655 67.5548 88.3433 113.2856 118.9312 126.9212 151.0750 154.1854 166.2064 184.0031 195.4103 199.2967 207.6195 227.6293 228.9672 256.6743 293.4395 303.9103 312.0768 320.6155 324.0680 331.8021 337.9437 386.7586 405.9612 449.0219 454.5530 495.0134 524.4619 539.7731 575.0313 592.0300 594.4453 602.7488 645.8760 666.3686 723.2136 741.0640 753.2799 796.1512 813.0440 846.7168 866.6638 891.1240 895.1415 929.1736 978.2343 1001.0249 1015.5265 1047.5511 1090.8668 1125.6239 1157.9149 1224.2439 1233.3769 1303.3845 1308.2919 1339.7425 1359.6791 1374.9147 1377.3931 1409.3534 1421.7495 1444.7985 1544.6353 1556.7115 1561.5803 1585.5383 3031.1705 3132.0014 3166.2438 3180.0615 3184.4368 3189.1371
redmass: 18.1038 12.5040 17.5950 6.7406 27.7796 19.6899 20.2689 6.6575 8.1526 14.9775 1.1809 6.0909 11.5503 30.8354 6.7434 26.9800 9.1760 8.3249 7.4147 5.1683 7.3978 25.7470 27.0149 9.5635 17.0359 12.4582 13.8805 9.9803 9.6594 5.4859 3.5054 12.5267 6.9884 8.6248 8.8189 5.2815 11.6559 11.8702 8.0390 8.1320 9.3486 4.1251 8.0067 13.0910 12.1573 8.8128 1.4332 1.5191 3.1351 1.3497 1.4172 6.3842 1.8491 7.9643 2.0065 6.8359 1.5332 4.0869 1.3392 1.1892 6.8873 11.9737 8.6100 5.0180 3.3346 1.0529 1.0539 4.1227 8.1102 10.0332 10.4033 8.6214 1.0244 1.0919 1.0931 1.1071 1.0934 1.1083
irintensity: 0.7364 0.9672 0.0476 3.6118 0.1767 0.5784 0.3426 3.4415 3.0748 1.1222 0.3783 0.0811 0.5041 0.0328 0.8053 0.0103 1.3587 1.3842 0.5294 1.4140 3.6986 0.1746 0.2553 14.9451 6.4580 0.0561 18.5095 7.0007 56.3333 10.5789 9.8373 39.5269 1.7273 26.8675 45.8782 1.4740 0.0571 17.6602 15.6242 42.6584 16.1527 10.1438 3.7796 64.7002 1.1661 7.3943 18.3336 2.9229 28.8252 16.1496 39.3002 127.1581 42.6615 38.0767 40.1178 3.7122 41.8018 31.9427 16.9515 10.5310 30.0424 0.6797 8.0945 79.8530 150.5274 10.8303 15.3131 43.9871 11.5445 8.2616 6.3628 0.3372 0.3977 35.1553 0.4319 0.1298 3.1266 0.6939
temp: 298.150 k
press: 1.00000 atm
elementType: 17 17 17 17 17 17 16 8 8 6 6 6 6 6 6 6 6 6 6 6 6 6 1 1 1 1 1 1
symmnumber: 1
zpe: 403373.3 jmol-1
zpe.correction: 0.153637 hartree
zpe.thermalcorrener: 0.176643 hartree
zpe.thermalcorrenthalpy: 0.177588 hartree
zpe.thermalcorrgfe: 0.098051 hartree
zpe.sumelectzpe: -3806.096407 hartree
zpe.sumelectthermal: -3806.073401 hartree
zpe.sumelectthermalent: -3806.072456 hartree
zpe.sumelectthermalfe: -3806.151993 hartree
dipole: 2.9206 3.9112 -2.4137
dipole: 5.4455
quadrupole: -180.5137 -180.4715 -180.5159
quadrupole: -22.9054 7.1398 -1.5614
quadrupole: -0.0133 0.0289 -0.0156 -22.9054 7.1398 -1.5614
hfenergy: -3806.250044 hartree
pointgroup: C01 [X(C13H6Cl6O2S1)]
dipole: -1.1868552 1.5409221 0.8983057 debye
polarizability: 314.7920471|3.5501955|218.8441486|15.9191896|-1.8481695|177.7045166 unknown
InChI: InChI=1S/C13H6Cl6O2S/c1-22(20,21)10-4-6(14)5(2-7(10)15)11-12(18)8(16)3-9(17)13(11)19/h2-4H,1H3
charge 0 multiplicity 1
28 atoms
Cl -0.352974 -0.046498 -2.793571
Cl 2.899199 0.05655 2.753064
Cl -1.461555 -2.781489 0.09017
Cl -1.467051 2.774812 -0.005975
Cl -4.723674 2.748316 0.13078
Cl -4.718886 -2.756214 0.2279
S  4.591089 -0.096795 -0.273087
O  5.196027 -1.311189 0.624544
O  4.808819 -0.05996 -1.894636
C  -0.145226 -0.003613 -0.002519
C  2.671605 -0.000518 -0.060493
C  -1.642517 -0.004082 0.053503
C  0.560924 -0.021905 -1.230393
C  0.597409 0.016259 1.20322
C  2.005182 0.016236 1.17403
C  1.966522 -0.022125 -1.273911
C  -2.367662 -1.222997 0.106094
C  -2.370282 1.2140 0.06359
C  5.238013 1.563756 0.421495
C  -3.781024 1.210872 0.12008
C  -3.778737 -1.219065 0.162787
C  -4.488849 -0.004242 0.169646
H  0.073482 0.033599 2.163326
H  2.529403 -0.04833 -2.215218
H  4.737238 2.359085 -0.147151
H  4.998618 1.576787 1.492895
H  6.320207 1.536016 0.231269
H  -5.580598 -0.004464 0.21256
