program: Gaussian 09
title: 000149189
version: EM64L-G09RevD.01
frameworkgroup: C1[X(C14H12ClNO3)]
method: RPBEPBE
basis: SDD
operation: Freq
keyword: #p
keyword: freq=noraman
keyword: PBEPBE/SDD
title: #p freq=noraman PBEPBE/SDD
converged: YES YES NO NO
title: Mulliken charges:
elementType: Cl O O O N C C C C C C C C C C C C C C H H H H H H H H H H H H
charge: -0.028462 -0.285181 -0.374729 -0.258650 -0.191426 0.425783 0.344851 -0.330297 -0.394741 -0.349411 -0.369325 0.464340 -0.322040 -0.339330 0.209509 -0.209700 -0.215406 -0.239079 -0.751260 0.305406 0.273323 0.268602 0.261229 0.273494 0.255687 0.234169 0.235628 0.260468 0.228001 0.251025 0.367523
chargesum: 0.00000
title: Mulliken charges with hydrogens summed into heavy atoms:
elementType: Cl O O O N C C C C C C C C C C C C C C
charge: -0.028462 -0.285181 -0.007206 -0.258650 -0.191426 0.425783 0.344851 -0.024892 -0.121418 -0.080809 -0.108096 0.464340 -0.322040 -0.065836 0.209509 0.045987 0.018764 -0.003451 -0.011765
polarizability: 2.86127443e+02 -7.42670373e+00 1.77570464e+02 7.56418443e+00 -5.01578765e+00 1.06577921e+02
1716.lowfreq: -4.2017 -3.2583 -0.0020 -0.0020 0.0018 2.1838 19.7369 23.6703 38.3325
frequency: 19.6432 23.6422 38.3109 58.6869 71.1441 116.1849 131.5032 142.1693 157.1394 174.6650 210.0773 246.8733 276.2515 307.9265 320.6418 336.2994 377.1525 394.3809 407.4553 414.7937 439.1777 441.0054 508.1762 523.7590 548.3346 556.2038 571.4577 591.2723 632.8942 649.6233 669.4775 704.0230 719.0141 753.0596 761.7763 828.6274 840.6960 855.7855 860.5619 897.4443 937.4390 956.1428 970.8686 977.4667 993.6605 1007.4018 1011.6357 1022.1856 1030.3875 1036.7057 1121.1299 1128.4068 1162.5301 1170.9603 1188.3434 1206.1975 1230.8364 1259.2161 1295.4822 1304.1910 1341.1084 1370.6028 1381.0339 1383.3194 1421.4722 1427.0650 1445.4569 1456.3862 1461.4319 1483.6232 1576.0560 1584.5609 1597.2140 1600.9315 1617.4187 3001.9806 3091.1085 3137.2716 3140.5905 3153.4470 3159.0423 3164.7395 3164.8513 3177.3306 3188.3401 3208.2434 3435.1637
redmass: 6.3796 8.2712 5.5496 4.2311 4.5726 5.8126 1.1279 3.9351 7.3672 6.4836 6.9990 5.5177 7.0510 1.2619 3.7756 5.4850 5.6249 6.3663 6.4757 3.1490 5.5050 3.6664 3.0558 4.1584 5.2214 3.1412 6.6448 5.6660 6.6843 5.8570 6.5016 4.2251 4.3609 1.6089 2.9093 1.2467 1.6562 1.4607 4.4053 5.0894 1.3617 1.3182 1.3251 1.3105 2.7279 1.9795 4.6765 6.7959 1.6890 2.1543 1.3296 1.5179 1.8075 1.0741 1.6658 2.5897 3.5616 1.5085 1.6032 1.6262 2.2351 6.1545 2.0840 2.1769 3.3045 2.4623 1.0902 1.0497 2.5374 2.5048 6.7061 7.4316 7.4937 7.5404 6.6671 1.0378 1.0959 1.1011 1.0857 1.0900 1.0913 1.0940 1.0902 1.1007 1.0955 1.0944 1.0683
irintensity: 3.0684 3.9195 0.6060 1.9275 1.2255 1.0296 3.5997 0.4198 2.1703 1.8664 17.3922 4.9768 5.3034 95.2058 20.9212 35.6982 0.1321 0.4614 10.8075 1.6237 6.4940 8.2578 26.2329 7.9518 10.8312 0.6031 8.4594 1.3215 1.8091 1.9162 21.6513 5.0432 2.1240 56.6162 44.6637 0.4165 74.3607 20.0219 48.1228 14.2862 1.5575 1.7759 1.1463 0.4426 13.4516 40.9131 16.8734 70.8249 8.8600 27.9270 8.3295 1.9440 43.1575 10.3684 2.7573 7.8262 567.1685 37.4561 57.0806 69.8181 187.9184 36.3440 36.2170 13.0521 15.2190 23.3765 21.8772 17.6833 217.6349 314.8743 10.3480 25.7313 71.4322 103.9259 2.6541 7.3054 11.1797 8.3261 1.5299 10.9808 5.0398 8.9827 1.5879 13.1311 1.2903 5.1482 8.3231
temp: 298.150 k
press: 1.00000 atm
elementType: 17 8 8 8 7 6 6 6 6 6 6 6 6 6 6 6 6 6 6 1 1 1 1 1 1 1 1 1 1 1 1
symmnumber: 1
zpe: 596687.1 jmol-1
zpe.correction: 0.227266 hartree
zpe.thermalcorrener: 0.244984 hartree
zpe.thermalcorrenthalpy: 0.245928 hartree
zpe.thermalcorrgfe: 0.179103 hartree
zpe.sumelectzpe: -1279.761231 hartree
zpe.sumelectthermal: -1279.743514 hartree
zpe.sumelectthermalent: -1279.742570 hartree
zpe.sumelectthermalfe: -1279.809394 hartree
dipole: 1.9097 -0.7279 0.6310
dipole: 2.1389
quadrupole: -96.8731 -113.8269 -119.3795
quadrupole: -24.8367 -1.3786 2.7822
quadrupole: 13.1534 -3.8004 -9.3530 -24.8367 -1.3786 2.7822
hfenergy: -1279.9884975 hartree
pointgroup: C01 [X(C14H12Cl1N1O3)]
dipole: -0.7666286 -0.2844279 -0.1988618 debye
polarizability: 286.4253113|1.9452667|175.5245697|9.7955449|-11.2200818|108.3259471 unknown
InChI: InChI=1S/C14H12ClNO3/c1-10(17)16(18)11-6-8-12(9-7-11)19-14-5-3-2-4-13(14)15/h2-9,18H,1H3
charge 0 multiplicity 1
31 atoms
Cl 4.199881 -1.955151 1.537312
O  1.747944 -1.181863 0.030057
O  -4.619646 -1.222201 -0.377476
O  -3.923763 2.190625 0.522449
N  -3.819517 -0.089038 0.063081
C  -2.398904 -0.300763 0.030374
C  0.379275 -0.805489 -0.004938
C  -1.496441 0.636736 0.606893
C  -1.893599 -1.489649 -0.560305
C  -0.111754 0.378696 0.588609
C  -0.507962 -1.739979 -0.575447
C  2.767405 -0.22712 -0.136522
C  4.013212 -0.489443 0.48345
C  2.636001 0.914852 -0.963705
C  -4.530153 1.116081 0.240863
C  5.111929 0.36972 0.29378
C  3.733453 1.781518 -1.151682
C  4.97206 1.514036 -0.524463
C  -6.040322 1.024134 0.09065
H  -1.880483 1.555683 1.05001
H  -2.581265 -2.197917 -1.027548
H  0.575062 1.095918 1.048504
H  -0.10511 -2.651372 -1.026194
H  1.681059 1.10995 -1.461371
H  6.062697 0.14323 0.785507
H  3.619589 2.660038 -1.795156
H  5.825474 2.183751 -0.669093
H  -6.323168 0.627225 -0.898488
H  -6.482829 0.353469 0.849314
H  -6.449266 2.036625 0.223001
H  -4.689161 -1.820003 0.420734
