program: Gaussian 09
title: 000149174
version: EM64L-G09RevD.01
frameworkgroup: C1[X(C16H12N2O)]
method: RPBEPBE
basis: SDD
operation: Freq
keyword: #p
keyword: freq=noraman
keyword: PBEPBE/SDD
title: #p freq=noraman PBEPBE/SDD
converged: NO NO NO NO
title: Mulliken charges:
elementType: O N N C C C C C C C C C C C C C C C C H H H H H H H H H H H H
charge: -0.266348 -0.441324 -0.041088 0.180288 0.131655 0.224521 0.194155 -0.162992 0.498139 -0.415959 -0.555364 -0.334129 -0.455944 0.309807 -0.344404 -0.348448 -0.185740 -0.369375 -0.536990 0.328649 0.231721 0.247963 0.238883 0.229099 0.249884 0.245186 0.227106 0.240007 0.243970 0.218535 0.218535
chargesum: 0.00000
title: Mulliken charges with hydrogens summed into heavy atoms:
elementType: O N N C C C C C C C C C C C C C C C C
charge: -0.266348 -0.112675 -0.041088 0.180288 0.131655 0.224521 0.194155 -0.162992 0.498139 -0.184237 -0.307402 -0.095246 -0.226845 0.309807 -0.094520 -0.103262 0.041366 -0.129369 0.144051
polarizability: 3.72283701e+02 4.35801547e+00 1.96608222e+02 2.65511787e-04 -2.59843058e-03 7.73723551e+01
1716.lowfreq: -0.0009 0.0008 0.0011 4.7140 5.8665 13.2215 48.7821 80.8388 110.9014
frequency: 48.7386 80.8353 110.9005 122.9445 155.5551 183.7431 196.7897 237.1220 277.0136 298.5901 315.6821 359.8892 384.3382 428.3580 440.9577 448.1119 491.9456 516.7566 517.3224 561.8637 564.4074 581.3806 602.3480 616.6255 627.2111 677.1456 705.2365 750.2935 750.3558 783.3781 787.9311 810.8569 811.4135 838.4122 844.7947 857.1737 875.3644 935.3851 942.1603 945.9191 958.4338 983.8035 999.9305 1026.7724 1052.8897 1077.4881 1116.9245 1125.2227 1143.7961 1157.0197 1184.3283 1203.0341 1222.7899 1228.4194 1249.1695 1278.1730 1304.4688 1327.6756 1349.5147 1380.9617 1404.7920 1415.8025 1420.6730 1435.2899 1460.7717 1465.7753 1466.9845 1479.8145 1493.2049 1526.7165 1543.7593 1586.3218 1594.1338 1619.4460 1637.8342 2947.2574 3029.2651 3117.7309 3123.0037 3124.2887 3130.2946 3141.1722 3148.3942 3156.1312 3163.6928 3171.0362 3601.7277
redmass: 5.0003 3.9467 4.8034 4.1452 4.3878 4.2013 4.2013 1.5980 2.1882 5.4778 4.7806 5.5446 5.8782 3.2892 3.3143 5.1227 5.4340 6.3609 3.3521 5.0591 5.3867 3.6819 1.1894 2.9216 7.1679 6.9068 4.4141 2.6469 6.1558 1.3502 6.5929 2.9644 1.6599 5.6727 1.8547 1.7676 5.0096 1.4139 1.3374 4.7847 1.3530 1.3886 4.0547 3.0663 2.7177 2.5729 1.2616 1.2999 1.2403 1.3623 2.0742 1.8889 1.7911 1.7415 2.7186 1.9330 2.0198 3.5767 4.5065 3.4328 2.9272 2.3479 2.5320 1.4023 3.6617 1.0496 2.5134 1.1959 4.8098 5.2534 6.4612 7.0796 6.7319 7.2855 7.9055 1.0338 1.1032 1.0985 1.0867 1.0871 1.0921 1.0893 1.0972 1.0910 1.0990 1.0958 1.0803
irintensity: 1.3329 0.3545 0.2290 9.2792 1.1000 1.7007 7.7056 0.7939 1.2669 1.6594 0.3129 0.8968 1.8504 0.0009 6.2997 5.0617 1.6681 13.0261 0.2783 6.5393 2.0988 0.2766 93.0825 18.4507 0.7092 0.5015 15.3699 2.5413 9.8944 9.1048 26.9774 7.4353 64.5565 0.3417 82.0595 17.2031 6.8663 0.6967 0.0153 5.2701 0.0046 1.4352 43.7683 1.7530 6.3538 17.3973 0.1812 1.3601 2.7793 2.8405 150.9078 61.1057 47.8188 13.0108 16.3520 1.8380 85.2906 2.9790 0.9748 143.8286 3.7952 21.6579 1.2643 59.7842 11.2753 13.0991 159.8915 4.0271 55.4061 36.2950 0.6776 26.5970 23.1401 37.3365 16.2131 65.4531 54.3657 33.5574 0.9858 8.9545 22.3200 8.2678 22.3537 12.1532 40.1769 9.0939 73.6416
temp: 298.150 k
press: 1.00000 atm
elementType: 8 7 7 6 6 6 6 6 6 6 6 6 6 6 6 6 6 6 6 1 1 1 1 1 1 1 1 1 1 1 1
symmnumber: 1
zpe: 629602.9 jmol-1
zpe.correction: 0.239803 hartree
zpe.thermalcorrener: 0.253985 hartree
zpe.thermalcorrenthalpy: 0.254930 hartree
zpe.thermalcorrgfe: 0.199012 hartree
zpe.sumelectzpe: -800.360678 hartree
zpe.sumelectthermal: -800.346496 hartree
zpe.sumelectthermalent: -800.345552 hartree
zpe.sumelectthermalfe: -800.401470 hartree
dipole: 0.7047 1.8880 0.0004
dipole: 2.0152
quadrupole: -94.7487 -92.5070 -116.6255
quadrupole: -4.2692 -0.0023 -0.0002
quadrupole: 6.5451 8.7867 -15.3318 -4.2692 -0.0023 -0.0002
hfenergy: -800.6004816 hartree
pointgroup: C01 [X(C16H12N2O1)]
dipole: -0.3006071 0.7336431 -0.0001669 debye
polarizability: 372.3835486|1.2006236|196.508374|0.0001832|0.0026055|77.3723551 unknown
InChI: InChI=1S/C16H12N2O/c1-19-11-5-7-14-13(9-11)12-6-4-10-3-2-8-17-15(10)16(12)18-14/h2-9,18H,1H3
charge 0 multiplicity 1
31 atoms
O  5.082471 0.42712 0.000868
N  -0.128692 -1.61591 0.000561
N  -3.082754 -1.491024 0.000665
C  -0.024851 0.682694 0.000626
C  -0.888965 -0.453279 0.000612
C  1.336766 0.165476 0.00068
C  1.234426 -1.271178 0.000628
C  -2.310647 -0.341759 0.000704
C  -2.86181 1.001118 0.000744
C  -0.595448 1.993409 0.000644
C  2.613034 0.785023 0.000784
C  2.38333 -2.092818 0.000648
C  -1.983858 2.145332 0.000721
C  3.756361 -0.043014 0.000807
C  3.641167 -1.467004 0.000746
C  -4.288105 1.10351 0.000773
C  -5.070387 -0.058723 0.000736
C  -4.425131 -1.334372 0.000696
C  5.282821 1.872145 0.000607
H  -0.536535 -2.549364 0.000583
H  0.05336 2.876531 0.000652
H  2.696903 1.875901 0.000795
H  2.3101 -3.185387 0.000558
H  -2.429484 3.147121 0.000707
H  4.563685 -2.055502 0.000749
H  -4.757996 2.094191 0.000771
H  -6.163726 -0.004019 0.000752
H  -5.01858 -2.256268 0.000666
H  6.37363 2.01686 0.000464
H  4.845713 2.343248 0.90432
H  4.845502 2.342941 -0.903165
