program: Gaussian 09
title: 000149195
version: EM64L-G09RevD.01
frameworkgroup: C1[X(C17H18N4O)]
method: RPBEPBE
basis: SDD
operation: Freq
keyword: #p
keyword: freq=noraman
keyword: PBEPBE/SDD
title: #p freq=noraman PBEPBE/SDD
converged: YES YES NO NO
title: Mulliken charges:
elementType: O N N N N C C C C C C C C C C C C C C C C C H H H H H H H H H H H H H H H H H H
charge: -0.298356 -0.086267 -0.374870 -0.123093 0.002034 -0.333894 -0.394904 0.163219 0.028363 0.036180 0.145491 0.106517 0.023458 -0.350751 -0.338087 -0.618367 -0.617257 -0.214755 -0.345245 -0.318888 -0.208727 -0.218684 0.176757 0.254355 0.254885 0.208898 0.368596 0.290253 0.268942 0.236200 0.185436 0.218791 0.225444 0.186285 0.218383 0.241730 0.256200 0.267505 0.238353 0.239871
chargesum: 0.00000
title: Mulliken charges with hydrogens summed into heavy atoms:
elementType: O N N N N C C C C C C C C C C C C C C C C C
charge: -0.298356 -0.086267 -0.006274 -0.123093 0.002034 0.097218 0.068878 0.163219 0.028363 0.036180 0.145491 0.106517 0.023458 -0.060498 -0.069145 0.022060 0.012855 0.026975 -0.089045 -0.051383 0.029625 0.021187
polarizability: 3.10940110e+02 -2.57452906e+01 3.15411419e+02 1.32206535e+01 8.49562428e+00 1.07717071e+02
1716.lowfreq: -6.6830 -0.0010 -0.0009 -0.0005 2.1469 5.2134 17.6241 29.3927 32.2165
frequency: 17.4948 29.3663 32.0518 65.6125 74.7641 87.9133 102.7622 116.0303 164.5799 185.1545 213.8422 219.0031 237.3250 246.2328 272.2276 289.5285 325.4721 340.8784 350.6275 387.9018 404.6395 418.9710 429.4899 485.0089 485.8654 497.0578 521.4848 531.5586 542.2157 585.9215 605.1063 630.5479 663.2466 721.7668 726.9547 757.9320 767.9419 774.8676 793.0133 811.9041 830.6484 842.8361 849.0598 867.6853 885.1027 904.2177 954.8412 967.4729 974.5269 1000.2533 1004.3312 1010.7891 1014.9060 1032.7089 1035.5872 1055.6376 1071.4181 1078.6496 1091.2388 1123.5621 1136.7833 1152.2613 1164.6904 1190.1359 1197.2137 1231.4429 1255.6931 1264.2629 1268.0275 1274.0481 1275.2426 1284.6190 1302.1961 1324.1442 1346.2917 1367.1741 1377.4327 1403.3419 1418.5207 1421.4053 1439.4332 1450.4349 1462.2675 1462.4509 1468.1125 1469.0274 1474.7630 1480.9059 1485.6195 1499.3479 1529.9055 1547.5207 1551.5987 1579.9968 1606.5193 1632.3821 2840.0816 2846.3558 2863.3365 3014.1685 3017.5074 3021.2811 3051.1242 3075.4648 3081.0935 3086.7852 3137.9856 3142.5134 3149.9377 3155.9218 3163.9484 3174.3866 3175.5539 3219.8430
redmass: 3.3536 3.1009 4.9624 6.3643 4.5044 2.4776 5.3596 3.6449 4.0676 3.2376 1.3667 1.9332 1.6369 3.2550 3.1045 4.3532 5.3391 7.3293 2.8961 3.4851 3.8346 3.1106 3.8094 4.1977 3.8715 3.4662 7.2334 5.9752 5.2921 3.8238 7.7760 7.1675 6.1066 4.7075 3.9127 2.3819 2.5150 1.4379 2.1494 3.0733 3.2269 2.3813 4.2970 1.1446 1.6673 6.6500 5.4184 1.3521 1.3470 1.3326 2.1647 1.3797 3.3496 2.4143 1.6795 2.3556 2.3061 1.7046 1.3944 1.6350 1.4974 1.2705 1.1844 1.9413 2.0090 2.6089 3.2735 2.1193 2.6694 2.4887 1.8504 2.7436 1.1965 1.3190 2.8783 1.3181 2.2775 5.8429 1.1395 3.8856 1.1471 1.1404 1.4595 1.7448 1.0986 2.9201 1.0517 1.0909 1.0573 7.4662 6.4183 1.9470 6.2694 4.9216 5.9252 6.3865 1.0580 1.0645 1.0627 1.0608 1.0724 1.0700 1.0883 1.1010 1.1003 1.1043 1.0860 1.0875 1.0892 1.0915 1.0964 1.0992 1.1005 1.0852
irintensity: 0.4061 0.1638 0.5676 2.8482 0.4544 1.1194 6.2795 3.7778 0.5468 0.0029 0.1997 7.3888 2.8572 0.4387 6.1086 2.8107 12.6677 7.9015 10.3226 4.5186 1.9956 5.3745 1.4620 9.9152 2.0620 0.5871 2.0431 0.7828 3.7913 0.0646 3.0970 1.8803 7.8479 8.4006 4.1952 62.8532 4.9198 63.8458 6.5106 3.8496 12.7704 36.0931 11.0681 83.5210 10.0405 2.1120 12.3876 0.2180 2.8523 0.0078 7.6869 1.8656 13.5797 15.3393 14.7019 61.8057 15.2146 8.0425 11.2880 6.7790 9.6036 4.9031 0.5591 8.4758 3.6172 6.5590 13.6725 16.0176 2.5243 8.5418 16.8672 7.7272 0.7353 0.3520 16.9582 1.5369 2.1901 0.0870 3.2651 21.1535 3.8783 16.3919 10.4679 35.1796 8.7778 5.5814 32.8077 14.0163 9.6605 16.8959 41.5651 229.9458 27.2584 94.4754 70.3349 18.0936 73.1772 74.1671 229.3444 18.5494 40.2158 83.4639 3.8235 22.0021 53.0890 25.8263 1.6912 4.7902 5.7496 1.9163 14.5441 23.3337 24.4608 437.1134
temp: 298.150 k
press: 1.00000 atm
elementType: 8 7 7 7 7 6 6 6 6 6 6 6 6 6 6 6 6 6 6 6 6 6 1 1 1 1 1 1 1 1 1 1 1 1 1 1 1 1 1 1
symmnumber: 1
zpe: 840509.6 jmol-1
zpe.correction: 0.320133 hartree
zpe.thermalcorrener: 0.339580 hartree
zpe.thermalcorrenthalpy: 0.340525 hartree
zpe.thermalcorrgfe: 0.270247 hartree
zpe.sumelectzpe: -951.272146 hartree
zpe.sumelectthermal: -951.252699 hartree
zpe.sumelectthermalent: -951.251754 hartree
zpe.sumelectthermalfe: -951.322032 hartree
dipole: 3.1208 -3.8959 1.1064
dipole: 5.1129
quadrupole: -124.0279 -112.5906 -133.8426
quadrupole: 5.1329 -4.4676 3.7582
quadrupole: -0.5409 10.8964 -10.3556 5.1329 -4.4676 3.7582
hfenergy: -951.592279 hartree
pointgroup: C01 [X(C17H18N4O1)]
dipole: 1.2855979 -1.0235783 1.1601649 debye
polarizability: 310.0612516|-8.6445987|275.9875548|41.6397675|-76.6696724|148.0197939 unknown
InChI: InChI=1S/C17H18N4O/c1-21(2)11-10-18-17(22)12-6-5-9-15-16(12)20-14-8-4-3-7-13(14)19-15/h3-9,18H,10-11H2,1-2H3
charge 0 multiplicity 1
40 atoms
O  -2.718099 1.856137 -1.807905
N  -5.478165 -1.150107 0.091223
N  -1.930823 -0.107448 -0.826305
N  0.671543 -0.154484 -0.041612
N  3.162553 1.28023 0.09295
C  -4.209343 -0.39618 0.184081
C  -3.218501 -0.803934 -0.938903
C  -0.385816 1.786323 -1.120516
C  0.763153 1.126232 -0.528769
C  2.041083 1.84763 -0.453925
C  -1.773482 1.180717 -1.275503
C  1.78781 -0.728147 0.506217
C  3.051915 0.002402 0.573506
C  -0.229352 3.090917 -1.598107
C  2.136907 3.1863 -0.963741
C  -6.635872 -0.415294 0.637641
C  -5.386218 -2.519964 0.630138
C  1.018195 3.792106 -1.52496
C  1.722718 -2.065732 1.023342
C  4.200857 -0.634583 1.155606
C  2.856322 -2.651506 1.580376
C  4.10294 -1.932692 1.647336
H  -3.712515 -0.522174 1.180336
H  -4.424283 0.679234 0.055981
H  -3.685749 -0.556698 -1.907619
H  -3.024552 -1.891253 -0.912048
H  -1.090962 -0.547223 -0.40061
H  -1.115452 3.56162 -2.038411
H  3.106059 3.688244 -0.889766
H  -6.718239 0.568034 0.142871
H  -6.577926 -0.244917 1.743387
H  -7.563898 -0.979709 0.431544
H  -6.327729 -3.062556 0.429904
H  -5.200244 -2.546115 1.735508
H  -4.57019 -3.075607 0.135664
H  1.081365 4.812472 -1.9168
H  0.768101 -2.597932 0.964705
H  5.133986 -0.064476 1.192745
H  2.806584 -3.672197 1.974675
H  4.977722 -2.41977 2.090961
