program: Gaussian 09
title: 000149178
version: EM64L-G09RevD.01
frameworkgroup: C1[X(C16H18N2)]
method: RPBEPBE
basis: SDD
operation: Freq
keyword: #pfreq=noraman
keyword: PBEPBE/SDD
title: #p freq=noraman PBEPBE/SDD
converged: YES YES NO NO
title: Mulliken charges:
elementType: N N C C C C C C C C C C C C C C C C H H H H H H H H H H H H H H H H H H
charge: -0.285048 -0.096737 -0.247723 -0.190010 -0.373333 -0.174405 0.321357 -0.256842 -0.254298 0.196671 -0.296758 -0.390608 -0.503212 -0.403729 -0.245940 -0.215079 -0.178001 -0.603998 0.242794 0.259451 0.263492 0.235035 0.259041 0.228007 0.229068 0.233377 0.216361 0.214369 0.212133 0.269031 0.217594 0.217348 0.226808 0.220718 0.221691 0.231376
chargesum: 0.00000
title: Mulliken charges with hydrogens summed into heavy atoms:
elementType: N N C C C C C C C C C C C C C C C C
charge: -0.026007 -0.096737 -0.004929 0.069441 -0.109841 0.060631 0.321357 -0.028835 -0.025230 0.196671 -0.063381 -0.174246 -0.076711 -0.134698 -0.028345 0.002269 0.048807 0.069786
polarizability: 2.75681008e+02 -1.44742205e+01 1.91672461e+02 -1.09303744e+01 -2.77369286e+00 1.12755341e+02
1716.lowfreq: -2.4514 0.0006 0.0007 0.0008 6.3668 16.1141 35.2004 41.0086 72.6763
frequency: 35.1765 40.9973 72.6255 91.7099 141.4792 149.3609 194.0714 212.9268 220.8837 250.0778 268.8882 323.1398 394.3024 408.1159 418.8438 441.8783 481.0991 488.2074 524.7851 542.2562 566.5533 584.9398 615.9491 642.4517 679.0085 685.9608 710.2900 717.6307 739.5150 756.3838 783.6215 796.4530 807.7599 856.1034 878.2938 914.4459 926.6111 942.0941 952.4841 956.5941 965.7535 972.1952 982.8731 984.1431 989.4711 1000.9369 1018.4434 1049.4765 1061.6490 1110.8481 1118.1553 1136.7370 1153.3744 1165.5804 1175.3638 1176.6543 1180.1893 1185.8836 1207.0839 1225.1378 1237.7176 1248.9896 1257.6439 1279.3030 1287.8102 1302.7782 1315.0244 1327.7249 1335.4894 1368.1330 1376.8298 1403.9179 1408.7304 1420.9504 1432.2022 1457.7693 1460.9179 1485.0173 1506.3879 1543.5362 1604.7908 1610.7517 1630.7648 1654.4866 2812.0119 2925.8634 2954.6851 2969.7272 2975.4710 2995.7076 3006.7282 3009.3080 3089.3376 3095.2845 3097.7884 3109.0323 3130.1037 3135.7544 3140.9387 3147.3457 3192.0037 3381.5029
redmass: 3.6179 4.1815 2.8991 3.4398 1.8455 3.4930 2.9802 2.2149 2.6943 2.9777 3.1185 3.2948 3.4271 3.5596 3.0839 3.8189 3.7626 3.4497 4.5240 4.5709 5.1782 4.2737 3.9613 3.3144 3.2640 2.2986 4.0511 1.6132 1.8935 1.4652 2.3223 1.6821 2.9389 3.9491 3.1792 1.3372 3.5106 1.3123 4.6843 2.5333 1.4390 3.2584 1.4198 2.1908 1.9992 2.3119 2.1322 1.9062 2.9130 1.8228 1.3072 1.8060 1.2282 1.6727 1.3642 1.5147 1.1236 1.1043 1.3701 2.3268 1.2960 1.5171 1.4815 1.2393 1.5392 1.7686 1.6668 1.3204 1.5258 1.5867 1.6298 2.1186 1.8177 1.3419 1.2648 1.7604 1.1037 1.0776 1.3638 5.2857 7.9059 5.9088 6.0855 6.0086 1.0732 1.0456 1.0843 1.0834 1.0835 1.0845 1.0862 1.0906 1.0974 1.0858 1.0848 1.0848 1.0963 1.0972 1.0898 1.1007 1.0952 1.0748
irintensity: 0.0912 0.9876 0.5660 1.1589 3.1859 0.9538 1.3117 3.5340 1.2899 17.4123 3.5792 4.9039 2.5800 1.8396 3.0765 4.4958 4.7506 5.2404 2.4154 4.6955 0.8991 1.4447 5.7576 7.7989 9.9352 4.8638 31.3302 59.1812 127.9164 24.3816 39.3476 11.4033 35.7201 13.5972 4.2205 0.5882 6.7879 2.3614 13.7840 5.2712 1.5557 1.1423 1.4477 0.4396 11.0225 6.6763 5.4977 54.5078 10.3821 2.1782 8.2613 14.7543 6.8817 14.7351 7.5691 45.4113 2.4506 2.7470 2.8163 3.8266 1.9319 47.1769 11.5574 6.3749 13.1024 1.0088 82.6042 12.7354 23.5944 2.3293 10.6496 1.5266 0.7235 8.6459 26.1484 7.1852 22.9788 6.9069 45.2279 238.6627 6.6591 138.8825 68.0568 1.3196 135.9784 163.9124 66.7007 13.4059 22.7172 2.0806 56.9663 43.7116 16.8427 16.8558 1.0767 2.4022 38.7052 39.3831 8.8957 53.0552 11.6656 1.3483
temp: 298.150 k
press: 1.00000 atm
elementType: 7 7 6 6 6 6 6 6 6 6 6 6 6 6 6 6 6 6 1 1 1 1 1 1 1 1 1 1 1 1 1 1 1 1 1 1
symmnumber: 1
zpe: 790732.7 jmol-1
zpe.correction: 0.301174 hartree
zpe.thermalcorrener: 0.316206 hartree
zpe.thermalcorrenthalpy: 0.317150 hartree
zpe.thermalcorrgfe: 0.258679 hartree
zpe.sumelectzpe: -728.619527 hartree
zpe.sumelectthermal: -728.604496 hartree
zpe.sumelectthermalent: -728.603551 hartree
zpe.sumelectthermalfe: -728.662022 hartree
dipole: 2.1841 0.6619 -0.4759
dipole: 2.3313
quadrupole: -85.5097 -103.2967 -108.9782
quadrupole: -1.3337 -6.7201 -0.8915
quadrupole: 13.7518 -4.0352 -9.7166 -1.3337 -6.7201 -0.8915
hfenergy: -728.9207012 hartree
pointgroup: C01 [X(C16H18N2)]
dipole: -0.8564469 0.2528779 0.2093013 debye
polarizability: 274.946255|15.1946508|191.7750548|-14.3472986|3.3295575|113.3875009 unknown
InChI: InChI=1S/C16H18N2/c1-18-9-8-12-11(10-18)6-7-14-13-4-2-3-5-15(13)17-16(12)14/h2-9,13-17H,10H2,1H3
charge 0 multiplicity 1
36 atoms
N  1.074159 -1.333495 -1.002523
N  -3.810521 -0.408907 0.398114
C  1.033072 1.089425 -0.817613
C  1.813064 0.543979 0.465541
C  0.191774 -0.151758 -1.24799
C  1.782884 -1.032513 0.30153
C  -1.12406 -0.252695 -0.469976
C  0.216817 2.330697 -0.545062
C  3.184384 1.164376 0.58384
C  -1.724249 0.902196 0.015586
C  3.127061 -1.724565 0.33675
C  -1.087665 2.206924 -0.132638
C  -3.048505 0.808729 0.771915
C  -1.80842 -1.525877 -0.397339
C  4.336509 0.428773 0.559433
C  4.303747 -1.037485 0.444463
C  -3.13485 -1.550645 -0.003983
C  -5.207942 -0.446008 0.827621
H  1.787237 1.282803 -1.604898
H  1.207298 0.829022 1.347544
H  -0.04675 -0.12116 -2.330876
H  1.135589 -1.445251 1.100392
H  1.77221 -1.413933 -1.761003
H  0.689973 3.315542 -0.635302
H  3.228526 2.258481 0.676672
H  3.118122 -2.819559 0.260489
H  -1.672098 3.103055 0.11856
H  -2.878156 0.817635 1.880441
H  -3.680881 1.694948 0.551135
H  -1.297686 -2.431949 -0.727073
H  5.311499 0.925827 0.633051
H  5.256461 -1.58195 0.454378
H  -3.734082 -2.466795 -0.043733
H  -5.30025 -0.365387 1.933311
H  -5.679903 -1.389599 0.506823
H  -5.774571 0.39332 0.379222
