program: Gaussian 09
title: 000149180
version: EM64L-G09RevD.01
frameworkgroup: C1[X(C17H20N2O)]
method: RPBEPBE
basis: SDD
operation: Freq
keyword: #p
keyword: freq=noraman
keyword: PBEPBE/SDD
title: #p freq=noraman PBEPBE/SDD
converged: YES YES NO NO
title: Mulliken charges:
elementType: O N N C C C C C C C C C C C C C C C C C H H H H H H H H H H H H H H H H H H H H
charge: -0.275607 -0.283684 -0.099509 -0.189847 -0.230067 -0.280752 -0.295090 0.254423 -0.286103 -0.396157 0.206786 -0.172860 -0.379711 -0.493813 0.307348 -0.393822 -0.331685 -0.189071 -0.601860 -0.536272 0.251517 0.239457 0.233159 0.254161 0.262015 0.225210 0.243251 0.243823 0.214260 0.211942 0.210956 0.255726 0.242557 0.228383 0.220121 0.221057 0.229690 0.218449 0.220561 0.241060
chargesum: 0.00000
title: Mulliken charges with hydrogens summed into heavy atoms:
elementType: O N N C C C C C C C C C C C C C C C C C
charge: -0.275607 -0.021668 -0.099509 0.061670 0.009390 -0.047594 -0.040929 0.254423 -0.060893 -0.152907 0.206786 0.070962 -0.165451 -0.070915 0.307348 -0.138095 -0.089128 0.039312 0.069008 0.143798
polarizability: 3.18204229e+02 -1.68870208e+01 1.94096236e+02 1.15740510e+01 8.12565431e+00 1.20935641e+02
1716.lowfreq: -0.0002 0.0001 0.0004 1.6385 7.0074 10.9805 18.2814 43.9826 62.0377
frequency: 15.2175 43.9126 61.9841 65.6689 100.4643 124.6059 133.7895 152.9969 193.8741 199.9407 223.1787 235.6586 247.3383 290.9295 310.2521 316.6677 381.8064 396.7976 424.1818 424.5130 440.6462 478.5978 500.6975 523.5138 545.7571 552.5168 597.7880 628.8402 671.6038 688.5504 702.9944 715.6690 726.4895 735.4283 739.9911 758.3322 781.0594 790.3754 833.0706 845.0538 884.8625 896.9408 910.9788 933.2909 947.1791 949.1224 976.4897 979.5977 991.3698 1003.8177 1014.7983 1039.4469 1055.7477 1079.7877 1114.1992 1118.2078 1126.7115 1133.3893 1145.4726 1153.5958 1166.6828 1172.8807 1182.5547 1186.8886 1194.6188 1205.5282 1227.7144 1230.6360 1243.7487 1253.8110 1277.8380 1284.1780 1297.3133 1302.8864 1318.2974 1325.2469 1343.1744 1382.9867 1391.2097 1409.4809 1425.9108 1430.8629 1434.9439 1455.1410 1459.6212 1459.9522 1473.6717 1486.1221 1508.7854 1562.1833 1610.9238 1620.8197 1647.9813 1651.9645 2803.8600 2921.9528 2947.7431 2953.6380 2957.1013 2964.9443 2988.3735 3006.6385 3007.2415 3037.8126 3087.7011 3088.6696 3119.0644 3122.5401 3128.3481 3141.2462 3144.7932 3158.7769 3187.2743 3394.1682
redmass: 4.5524 3.6696 3.5874 2.8238 3.1109 2.9869 2.1758 3.4578 1.9263 2.5144 1.4154 2.1225 3.4956 3.2951 3.6322 4.0516 4.2267 3.0263 3.8942 3.1598 3.6613 3.8080 5.1153 4.2909 4.0511 2.9775 3.7926 4.8153 4.0269 4.1994 2.2092 3.5116 1.6879 1.6231 2.8100 1.6134 2.0994 2.7947 4.5440 3.5267 2.6233 1.4921 3.2936 2.8178 1.4167 2.3015 1.6405 3.0637 3.2209 2.1276 2.2397 1.7607 2.2217 3.2543 1.2700 1.3160 1.7823 1.9751 1.1754 1.4026 1.2450 2.0635 2.2082 1.5836 1.7429 1.3779 1.8356 1.3518 1.6047 1.4166 1.2339 1.4707 1.5182 1.5920 1.5980 1.5774 1.6252 1.7294 1.8284 2.0718 1.2965 1.2597 1.2675 1.5183 1.0507 1.2397 1.0522 1.0839 1.3353 5.1651 7.9682 6.1173 6.5209 6.8463 1.0734 1.0466 1.0837 1.0331 1.0835 1.0833 1.0844 1.0863 1.0896 1.1033 1.0839 1.0971 1.0978 1.0993 1.0858 1.0894 1.0912 1.0994 1.0962 1.0751
irintensity: 0.5074 0.6055 1.0984 0.4396 2.2552 1.7196 3.0336 9.4236 1.2430 3.7747 1.0402 3.7377 1.9317 2.1971 4.9405 0.5303 0.4753 7.6061 1.3066 2.0839 7.3718 1.6506 4.3954 6.9576 1.9729 15.6231 21.1925 22.8288 3.9419 5.2824 24.8901 8.9351 86.0372 19.4861 4.7041 6.0032 88.7545 33.2368 35.5379 2.8886 2.6512 2.0284 7.4503 4.6933 2.2720 2.6497 7.3382 13.2352 21.6324 7.8316 6.9783 34.1772 18.0260 11.8496 0.1681 11.7853 11.9948 60.9560 13.5763 14.3487 8.3928 5.0550 140.3786 12.1128 41.6577 8.4003 10.5908 4.9739 45.1744 22.8735 3.1446 9.0521 1.3101 1.3176 94.3326 26.3703 14.2788 16.0243 40.1557 4.0746 9.2103 22.3675 12.3426 8.4127 14.4950 20.4538 24.3339 10.3671 32.6624 166.1785 91.1601 135.1115 23.7725 56.8840 153.7179 170.2279 67.3750 55.5274 16.0763 25.9776 15.1983 39.5165 48.7092 51.5668 4.5359 19.3676 39.0978 33.7259 1.8444 7.8881 20.1820 19.2489 9.7111 0.7133
temp: 298.150 k
press: 1.00000 atm
elementType: 8 7 7 6 6 6 6 6 6 6 6 6 6 6 6 6 6 6 6 6 1 1 1 1 1 1 1 1 1 1 1 1 1 1 1 1 1 1 1 1
symmnumber: 1
zpe: 872342.1 jmol-1
zpe.correction: 0.332258 hartree
zpe.thermalcorrener: 0.350121 hartree
zpe.thermalcorrenthalpy: 0.351065 hartree
zpe.thermalcorrgfe: 0.285657 hartree
zpe.sumelectzpe: -842.972452 hartree
zpe.sumelectthermal: -842.954588 hartree
zpe.sumelectthermalent: -842.953644 hartree
zpe.sumelectthermalfe: -843.019053 hartree
dipole: 2.2997 2.4042 1.2193
dipole: 3.5433
quadrupole: -93.3926 -113.4953 -120.2700
quadrupole: -7.1574 0.7719 1.8911
quadrupole: 15.6600 -4.4426 -11.2174 -7.1574 0.7719 1.8911
hfenergy: -843.3047097 hartree
pointgroup: C01 [X(C17H20N2O1)]
dipole: 0.9208448 0.9303092 0.4795213 debye
polarizability: 315.7922483|-20.8604523|195.8557981|19.3174354|4.3866058|121.5880591 unknown
InChI: InChI=1S/C17H20N2O/c1-19-8-7-13-11(10-19)3-5-14-15-9-12(20-2)4-6-16(15)18-17(13)14/h3-9,14-18H,10H2,1-2H3
charge 0 multiplicity 1
40 atoms
O  -5.17672 0.34576 -0.731691
N  -0.054356 -1.574372 0.570877
N  4.664436 -0.105751 0.153016
C  -0.537191 0.622348 -0.505904
C  -1.598449 0.309316 0.644482
C  0.408264 -0.646972 -0.532957
C  -1.489586 -1.240762 0.804151
C  1.903547 -0.394159 -0.414461
C  0.157204 1.943152 -0.277298
C  -2.990288 0.82576 0.338676
C  2.400433 0.883519 -0.214605
C  -2.405216 -1.968389 -0.168314
C  1.515423 2.041065 -0.12723
C  3.908279 1.125872 -0.187098
C  -3.878805 0.00528 -0.3076
C  2.801662 -1.535546 -0.457447
C  -3.536656 -1.384839 -0.655803
C  4.135499 -1.353215 -0.142985
C  6.088634 0.083718 0.424487
C  -5.616059 1.712412 -0.452784
H  -1.105446 0.667184 -1.455747
H  -1.221334 0.774717 1.575166
H  0.220587 -1.185539 -1.483858
H  -1.753804 -1.560872 1.833979
H  0.501763 -1.397162 1.423339
H  -0.473478 2.840394 -0.21877
H  -3.225262 1.868689 0.574753
H  -2.14189 -3.004874 -0.41103
H  1.970121 3.02531 0.053111
H  4.264438 1.52512 -1.173858
H  4.158599 1.904444 0.565057
H  2.412992 -2.538745 -0.641791
H  -4.235307 -1.92221 -1.306528
H  4.831595 -2.194581 -0.059647
H  6.617009 0.529445 -0.447679
H  6.563775 -0.882636 0.66221
H  6.23248 0.761561 1.288526
H  -4.960415 2.451714 -0.954558
H  -5.624148 1.912893 0.636959
H  -6.63753 1.781551 -0.855046
