program: Gaussian 09
title: 000149137
version: EM64L-G09RevD.01
frameworkgroup: C1[X(C7H8N2O2)]
method: RPBEPBE
basis: SDD
operation: Freq
keyword: #pfreq=noraman
keyword: PBEPBE/SDD
title: #p freq=noraman PBEPBE/SDD
converged: YES YES NO NO
title: Mulliken charges:
elementType: O O N N C C C C C C C H H H H H H H H
charge: -0.506406 -0.336700 -0.689443 -0.693455 -0.018419 0.393887 0.385285 -0.470549 -0.472015 -0.167706 0.175207 0.214315 0.218502 0.217726 0.302248 0.379991 0.376424 0.301651 0.389456
chargesum: 0.00000
title: Mulliken charges with hydrogens summed into heavy atoms:
elementType: O O N N C C C C C C C
charge: -0.116950 -0.336700 -0.007204 -0.015380 -0.018419 0.393887 0.385285 -0.256234 -0.253513 0.050021 0.175207
polarizability: 1.31547703e+02 6.25169383e-01 1.32830844e+02 3.80239215e-02 8.06157414e-03 4.11830892e+01
1716.lowfreq: -6.8892 -4.7681 -0.0011 -0.0007 -0.0003 12.2720 90.7003 112.1071 203.8931
frequency: 90.6997 112.1035 203.8923 253.7908 298.0950 371.8395 383.7544 412.0413 450.6160 468.0940 477.4285 523.1036 532.8994 559.2519 562.1380 616.7126 662.2632 670.5480 678.7103 725.4555 773.2490 791.2745 795.3448 826.7352 960.8201 978.2693 1003.1621 1034.3975 1127.3187 1146.9288 1165.1236 1187.3809 1276.1821 1327.5724 1382.5536 1396.4569 1474.9566 1483.1950 1550.5933 1600.0936 1615.0479 1621.8661 1637.8028 3121.6236 3136.2843 3156.0781 3391.5443 3478.6555 3535.1876 3648.0796 3666.1535
redmass: 7.0261 7.2007 3.9696 3.8281 6.3874 5.2445 4.5853 5.0162 1.1354 2.5021 1.2419 4.7204 4.0819 1.2459 5.4708 2.9834 4.1788 1.1680 3.2205 1.4068 1.3199 6.2830 4.0078 1.5390 1.3288 5.2183 2.4173 1.9098 1.3055 1.8116 1.6883 1.2486 3.0161 1.7403 3.5420 5.6995 2.7819 3.7195 2.9124 3.5648 2.9859 1.4672 2.1398 1.0852 1.0914 1.0997 1.0571 1.0501 1.0641 1.0937 1.1000
irintensity: 0.7408 0.0856 0.0029 45.9236 1.0006 7.1028 11.3689 4.7485 79.7766 21.7120 85.8506 1.9722 6.5054 125.9567 25.1471 8.6285 15.9510 257.6647 37.5852 65.7560 36.8611 1.9877 111.8434 0.0008 1.5260 213.9828 20.1869 18.0409 1.0897 46.0793 137.6549 19.0203 5.9869 37.8224 9.0693 67.5223 48.1231 106.9470 197.9326 221.4292 250.7289 335.8628 258.1764 4.3146 28.1031 24.3879 116.7567 134.3420 50.8803 49.6060 57.1816
temp: 298.150 k
press: 1.00000 atm
elementType: 8 8 7 7 6 6 6 6 6 6 6 1 1 1 1 1 1 1 1
symmnumber: 1
zpe: 384858.8 jmol-1
zpe.correction: 0.146585 hartree
zpe.thermalcorrener: 0.156073 hartree
zpe.thermalcorrenthalpy: 0.157017 hartree
zpe.thermalcorrgfe: 0.112404 hartree
zpe.sumelectzpe: -530.733314 hartree
zpe.sumelectthermal: -530.723826 hartree
zpe.sumelectthermalent: -530.722882 hartree
zpe.sumelectthermalfe: -530.767494 hartree
dipole: -0.4767 -1.3048 -0.0095
dipole: 1.3892
quadrupole: -56.8459 -48.9951 -69.6093
quadrupole: -5.9041 -0.0081 0.0407
quadrupole: 1.6375 9.4883 -11.1259 -5.9041 -0.0081 0.0407
hfenergy: -530.8798987 hartree
pointgroup: C01 [X(C7H8N2O2)]
dipole: -0.2045248 0.5056425 0.0348065 debye
dipolederiv: -0.8164723 -0.4552735 -0.0637127 -0.6316375 -0.8539352 -0.0766964 -0.0807244 -0.0659884 -0.4630458 -1.0726119 0.3337598 -0.0153192 0.4105658 -0.8756562 -0.0193952 -0.009286 -0.0237749 -0.3699511 -0.5063152 -0.5916575 -0.0402781 -0.3628993 -1.1972212 -0.0648188 -0.0197804 -0.0721746 -0.6728047 -0.4570735 0.5240627 0.0585433 0.3093744 -1.1954386 -0.0274858 0.0396398 -0.0134474 -0.6565747 -1.1052165 0.0668407 -0.0559469 0.0216861 -0.496492 -0.028966 -0.0585742 -0.026038 -0.1489194 0.8463772 0.8188508 0.1103426 0.0130164 1.114133 0.0772073 0.0402039 0.1263868 0.1950327 0.7388452 -0.8260298 -0.0365006 0.0201425 1.0630205 0.0790092 0.0382135 0.0252209 0.1779569 -0.5389311 -0.7670547 -0.0799344 -0.0989687 -0.3863136 -0.0119861 -0.0225364 -0.0538747 -0.321119 -0.4515079 0.7651194 0.058291 0.0816538 -0.4389898 -0.0047047 -0.0011372 0.0371773 -0.3104502 0.2118115 0.0208708 0.0187566 0.0397855 0.9163236 0.0878598 0.0201123 0.0871452 -0.0568211 2.0750182 -0.0163327 0.1168349 0.0501891 1.2086977 0.0914412 0.1229238 0.087284 0.2468975 0.0285162 0.0476789 -0.0054434 0.0978367 -0.1160465 -0.0204006 -0.0007926 -0.0228709 0.1834979 0.0244152 -0.0476003 -0.0144952 -0.1009072 -0.1022493 -0.0320421 -0.0192824 -0.0286454 0.1830931 -0.1404522 0.0070911 -0.0168547 0.0078511 0.110191 -0.0023705 -0.0167307 -0.0021203 0.1402892 0.1204221 0.0473062 -0.0103505 0.0455817 0.2326064 -0.0090212 -0.0106073 -0.0118546 0.3619425 0.3396506 0.0087638 -0.0020619 -0.0587015 0.2327017 -0.0165053 -0.0081605 -0.0152965 0.3770057 0.3328507 0.0463014 0.0016845 0.0161078 0.2924787 -0.0059105 -0.0009572 -0.0042028 0.3708893 0.1214462 -0.0622111 -0.0208562 -0.0444476 0.2320943 -0.0144507 -0.0194023 -0.0157867 0.3621568 0.2492276 0.079514 -0.0026992 0.1837711 0.2600954 -0.0007636 0.0068784 -0.0071388 0.4009244 unknown
polarizability: 131.2389429|-1.151552|132.1081685|5.5532714|7.8434263|42.2145252 unknown
InChI: InChI=1S/C7H8N2O2/c8-4-2-1-3-5(9)6(4)7(10)11/h1-3,10H,8-9H2
charge 0 multiplicity 1
19 atoms
O  2.455529 1.043322 0.319553
O  2.436113 -1.244151 0.114515
N  0.238033 2.40981 0.288381
N  0.147706 -2.517883 -0.141232
C  0.290928 -0.063431 0.082531
C  -0.422511 1.203039 0.146969
C  -0.482019 -1.291456 -0.0738
C  -1.84361 1.214174 0.061065
C  -1.901646 -1.230437 -0.158172
C  -2.556702 0.011056 -0.089002
C  1.737901 -0.178093 0.164121
H  -2.374119 2.171528 0.112389
H  -2.471806 -2.158211 -0.276685
H  -3.650678 0.043461 -0.153803
H  -0.301512 3.269682 0.333859
H  1.257163 2.423071 0.356433
H  1.172807 -2.548332 -0.079316
H  -0.408028 -3.361973 -0.250625
H  3.420052 0.807222 0.360519
