program: Gaussian 09
title: 000149115
version: EM64L-G09RevD.01
frameworkgroup: C1[X(C12H11N3)]
method: RPBEPBE
basis: SDD
operation: Freq
keyword: #pfreq=noraman
keyword: PBEPBE/SDD
title: #p freq=noraman PBEPBE/SDD
converged: NO YES NO NO
title: Mulliken charges:
elementType: N N N C C C C C C C C C C C C H H H H H H H H H H H
charge: -0.233625 -0.095368 -0.622273 0.160403 0.292848 -0.005810 0.442018 0.116094 -0.350715 -0.478463 -0.358860 -0.639522 -0.451521 -0.277644 -0.252344 0.246314 0.235518 0.226455 0.252665 0.202342 0.252542 0.238647 0.221862 0.225341 0.310799 0.342294
chargesum: 0.00000
title: Mulliken charges with hydrogens summed into heavy atoms:
elementType: N N N C C C C C C C C C C C C
charge: -0.233625 -0.095368 0.030820 0.160403 0.292848 -0.005810 0.442018 0.116094 -0.104400 -0.242944 -0.132405 0.068027 -0.212874 -0.055782 -0.027003
polarizability: 2.40950023e+02 -8.15717969e+00 1.66887003e+02 -1.32552676e-02 1.92157497e-02 6.31311110e+01
1716.lowfreq: -164.6141 -12.5724 -8.1851 -0.0009 -0.0005 -0.0003 4.1699 85.0147 92.5661
frequency: -164.6091 84.9864 92.5145 165.1144 183.6263 198.8837 209.0043 292.4655 315.1161 348.1888 350.9751 403.6938 424.7637 431.7235 497.0632 517.7722 556.3282 569.5654 587.6033 628.5696 673.4953 686.4139 701.8890 751.9043 752.2876 795.9024 804.8793 821.7578 872.7814 884.3515 946.4398 965.0860 982.8643 997.3107 1023.0162 1035.0563 1050.1961 1117.6916 1124.8957 1143.0962 1173.8263 1208.0686 1232.5310 1252.1323 1286.9782 1301.2321 1360.7657 1391.4733 1409.7696 1418.8635 1451.5030 1453.2990 1469.9504 1473.0970 1497.0181 1530.3477 1552.5985 1575.1402 1600.4058 1631.0556 1638.5214 2985.0532 3068.2275 3098.2279 3118.2165 3128.3075 3130.6054 3153.4052 3167.1214 3170.9662 3584.8644 3731.1894
redmass: 1.1444 3.1939 3.1859 1.5095 4.9862 4.1251 2.2313 4.3955 3.0203 3.7531 3.9268 6.2543 3.0164 1.2231 5.6402 3.4597 3.9093 3.2897 5.3017 6.0173 5.3087 9.8862 3.4350 1.3114 6.8423 3.0396 4.5957 1.5309 1.7334 3.9237 1.3484 1.3696 1.3562 3.4582 2.6650 2.2807 2.4974 1.3081 1.6355 1.3746 1.1018 2.1361 1.8486 2.1602 3.0843 3.3414 2.6604 5.3706 2.6798 2.2500 2.3716 2.6233 1.0411 2.5907 1.1070 4.0383 3.0966 3.7232 4.0685 6.5036 2.3105 1.0352 1.1030 1.0976 1.0862 1.0888 1.0891 1.0956 1.0963 1.0959 1.0452 1.1041
irintensity: 90.5867 21.6867 12.2983 0.0071 8.0656 3.3283 22.9899 1.3552 0.7969 3.5255 27.6145 0.3514 13.4432 151.6162 1.1323 0.8101 2.0811 5.4806 2.6561 14.3494 3.3619 14.3822 4.4749 49.1113 1.5405 0.0226 1.9716 66.2358 13.7470 1.4630 2.5845 0.7011 0.8945 16.7549 6.2603 0.7302 2.2866 0.8274 14.3945 0.8530 0.0739 1.1517 5.1371 9.2254 26.2113 67.8250 37.0020 12.2841 16.7543 19.8925 19.4548 15.9912 14.7001 44.9772 16.4703 96.6426 84.9025 4.4382 50.5176 54.9859 509.2727 45.8792 19.3352 31.9618 2.0001 2.2243 20.2709 37.7261 19.1887 24.0883 131.9259 40.3914
temp: 298.150 k
press: 1.00000 atm
elementType: 7 7 7 6 6 6 6 6 6 6 6 6 6 6 6 1 1 1 1 1 1 1 1 1 1 1
symmnumber: 1
zpe: 539719.4 jmol-1
zpe.correction: 0.205568 hartree
zpe.thermalcorrener: 0.217145 hartree
zpe.thermalcorrenthalpy: 0.218089 hartree
zpe.thermalcorrgfe: 0.168454 hartree
zpe.sumelectzpe: -627.114447 hartree
zpe.sumelectthermal: -627.102870 hartree
zpe.sumelectthermalent: -627.101926 hartree
zpe.sumelectthermalfe: -627.151561 hartree
dipole: -2.2322 -4.3518 -0.0024
dipole: 4.8909
quadrupole: -68.1337 -77.3532 -94.0966
quadrupole: 12.8633 0.0148 0.0054
quadrupole: 11.7275 2.5080 -14.2355 12.8633 0.0148 0.0054
hfenergy: -627.3200151 hartree
pointgroup: C01 [X(C12H11N3)]
dipole: 0.8102097 1.7453617 -0.0009332 debye
dipolederiv: -0.7348688 -0.1157054 -0.0000627 -0.0378319 -0.7304864 0.0000946 -0.0002132 -0.0001883 -0.13411 -1.0502996 -0.0975285 0.0000694 -0.6507326 -0.6253469 -0.0001132 0.0006081 0.0001694 -0.2887207 -1.7651982 -0.3362461 -0.0001893 -0.5926007 -0.329419 -0.0010442 -0.0017544 -0.0014265 -0.7498651 -0.078447 0.3959897 0.0002048 0.773273 0.1811333 -0.0000459 0.0000608 -0.0001031 0.0224622 0.491993 -0.1931325 0.0001208 -0.0387274 -0.0632336 -0.000024 0.0001796 0.0000202 0.0082588 0.9444632 0.1191999 -0.0000893 -0.2195348 -0.1555521 -0.0000646 -0.0002085 -0.0001431 -0.0055689 -0.2212532 -0.0102252 -0.0000392 -0.3331031 0.0022024 -0.0000047 -0.0000221 0.0000554 0.0442891 1.8832505 0.1836832 -0.000187 0.7302844 0.8078468 0.0003261 -0.0000071 0.0003362 0.1873546 0.0376049 0.0603683 0.000013 0.0353772 0.1764327 0.0000059 -0.0000376 0.0000141 -0.1579961 -0.1323058 -0.0188195 -0.0000342 0.1113312 0.0620414 -0.0000505 -0.0000868 -0.0000462 -0.2103093 -0.1401893 0.0236779 -0.0000575 0.1042887 0.0425512 -0.0001115 -0.0001766 -0.0001638 -0.1670717 0.1030378 -0.0256934 0.0001839 0.0731582 0.4898101 -0.0001678 0.0001463 -0.0003309 0.2263898 0.1515225 -0.0142882 0.0000341 0.0788077 0.1181703 -0.0000695 0.0000264 -0.0000705 -0.1738763 -0.0081071 0.017592 0.0000327 0.0265351 0.1236442 -0.0001576 0.0000343 -0.0001548 -0.1731946 -0.0075195 0.0452585 -0.0000107 0.0334683 -0.150165 -0.0000193 0.000001 0.000007 -0.1844039 0.0679629 0.0840401 -0.0000062 0.0497362 -0.0602853 0.0000162 0.0000697 0.000015 0.1605903 -0.0120873 -0.1338009 0.0000205 -0.063416 -0.0419175 0.000036 0.000018 0.0000126 0.1605896 0.0360654 -0.1119515 0.0000814 -0.0676049 -0.0749593 0.0000966 0.0000851 0.0001337 0.1409969 0.0735391 0.1044038 0.09085 0.0046209 -0.0212702 -0.0247859 0.0685472 -0.0725889 -0.0433896 -0.1629707 -0.141239 -0.000586 -0.0261676 0.0528042 -0.0000119 -0.0003171 -0.000097 0.1159157 0.0739592 0.1041144 -0.0903335 0.0045019 -0.0219493 0.025194 -0.0681162 0.0733017 -0.0439965 0.0123522 -0.058154 0.0000083 -0.1352779 -0.0609624 0.0000506 0.0000371 0.0000405 0.1532345 0.034667 0.0807351 -0.000048 0.109793 -0.1071786 0.0001313 -0.0000669 0.0001388 0.1596101 -0.1593426 0.0241711 -0.0000301 0.0257936 0.0852222 0.0000315 -0.0000339 0.0000272 0.1662531 0.2480442 0.0231771 -0.0000906 0.0576019 0.1393091 0.0004931 0.0008196 0.0009681 0.3905901 0.314127 -0.0096268 0.0001457 -0.0535745 0.1615577 0.0001945 0.0004073 0.0000731 0.3959681 unknown
polarizability: 241.4765956|-5.2213736|166.3604306|0.0140007|-0.0186796|63.131111 unknown
InChI: InChI=1S/C12H11N3/c1-15-11-9-5-3-2-4-8(9)6-7-10(11)14-12(15)13/h2-7H,13H2,1H3
charge 0 multiplicity 1
26 atoms
N  1.691088 0.96836 0.000501
N  2.524051 -1.176884 0.00015
N  4.121828 0.617032 0.000185
C  0.56354 0.102542 0.00029
C  -0.847421 0.346237 0.000006
C  1.116672 -1.212966 0.000346
C  -1.691306 -0.844718 0.000218
C  2.827757 0.134964 0.000205
C  0.270706 -2.358266 0.000462
C  -1.109073 -2.163062 0.00046
C  -1.488507 1.631983 -0.000577
C  1.684753 2.432177 0.001773
C  -3.114192 -0.682906 0.000081
C  -2.882134 1.748059 -0.000752
C  -3.707335 0.582685 -0.000353
H  0.715356 -3.357749 0.000523
H  -1.785674 -3.02561 0.000589
H  -0.889349 2.546478 -0.001054
H  1.178574 2.82635 0.900918
H  2.71747 2.817277 0.004416
H  1.182132 2.828225 -0.898572
H  -3.73929 -1.584361 0.000287
H  -3.34415 2.741867 -0.001247
H  -4.798025 0.683787 -0.000462
H  4.356343 1.602599 -0.002095
H  4.864388 -0.0759 0.000201
