program: Gaussian 09
title: 000149110
version: EM64L-G09RevD.01
frameworkgroup: C1[X(C14H16N2O2)]
method: RPBEPBE
basis: SDD
operation: Freq
keyword: #p
keyword: freq=noraman
keyword: PBEPBE/SDD
title: #p freq=noraman PBEPBE/SDD
converged: YES YES NO NO
title: Mulliken charges:
elementType: O O N N C C C C C C C C C C C C C C H H H H H H H H H H H H H H H H
charge: -0.261051 -0.257636 -0.335998 -0.468188 0.064518 0.204163 0.149662 -0.473654 -0.456155 0.159103 0.180724 -0.711063 0.215194 -0.428682 -0.370454 -0.255905 -0.223834 -0.503545 0.204448 0.227509 0.206081 0.213081 0.273964 0.327497 0.254310 0.218496 0.220068 0.231349 0.232578 0.217557 0.218795 0.244375 0.235296 0.247400
chargesum: 0.00000
title: Mulliken charges with hydrogens summed into heavy atoms:
elementType: O O N N C C C C C C C C C C C C C C
charge: -0.261051 -0.257636 -0.062034 -0.140691 0.064518 0.204163 0.149662 -0.041697 -0.036993 0.159103 0.180724 -0.018190 0.215194 -0.197333 -0.137877 -0.038348 -0.005039 0.223525
polarizability: 2.36865517e+02 7.12578553e+00 1.66338711e+02 1.31764287e+01 -1.05173257e+01 1.13300279e+02
1716.lowfreq: -6.1685 -0.0003 0.0006 0.0007 2.7531 13.1788 32.8685 57.7440 71.9350
frequency: 32.7856 57.7362 71.9229 108.1407 125.3541 137.7220 171.2997 189.0827 205.5403 232.4022 251.6579 253.7231 286.8833 307.0742 327.2914 337.6547 372.7352 427.8111 452.3214 483.1160 492.0184 543.5721 552.3796 575.4605 578.6022 591.7747 631.5375 669.4164 712.5063 718.4278 728.6387 750.3531 761.2655 774.3538 820.2089 849.8617 883.5596 903.0175 911.4210 929.8979 937.6370 968.2846 983.8299 1010.2716 1045.8038 1063.8722 1081.5124 1095.2462 1112.1193 1117.7621 1145.2894 1151.6264 1165.6559 1177.4002 1185.8141 1193.9877 1225.3309 1241.5669 1259.2331 1306.2217 1313.9627 1348.1011 1369.0435 1376.0941 1406.8039 1418.4748 1439.9540 1446.4157 1452.3465 1453.0553 1461.5924 1463.4337 1471.5788 1477.6461 1481.8392 1482.9705 1579.2844 1593.6035 1606.1370 1633.9148 2902.2027 2974.7776 2989.8596 3008.2761 3027.9002 3045.9102 3088.1277 3113.0045 3120.3219 3121.2217 3129.5907 3143.1407 3154.1021 3160.6453 3487.1724 3581.8992
redmass: 4.5938 3.9068 5.5219 1.0828 4.2239 3.3418 3.2501 3.5703 3.6757 2.1124 1.3969 2.6770 3.9502 3.4758 3.8330 5.6325 2.9852 2.9218 3.3917 4.8948 3.0049 4.5739 2.0064 2.0539 2.3894 4.0925 3.1806 4.5309 4.1320 4.8263 2.8338 1.4883 3.4832 4.1282 3.8991 1.4746 3.6857 2.0467 3.9747 1.3928 3.4737 1.2975 1.9355 2.0583 2.1785 2.6221 2.7897 2.4016 1.2833 1.5825 1.4717 3.3356 1.2942 2.2167 1.9684 1.7463 1.4844 2.2034 1.5031 1.6016 2.2843 1.6043 1.8706 1.1966 3.8768 1.1868 2.6580 1.2962 1.0510 1.1100 1.5987 1.0514 1.4052 1.1304 2.0314 1.9660 6.5553 7.0578 8.8855 7.1850 1.0703 1.0601 1.0359 1.0291 1.0998 1.0922 1.0982 1.1049 1.1012 1.0846 1.0889 1.0953 1.1053 1.1001 1.0747 1.0803
irintensity: 1.4938 0.8494 1.6437 0.1459 0.3108 1.8055 3.9218 1.3129 3.6734 1.7425 0.2223 5.8870 13.9066 1.9513 4.1100 11.9332 14.0887 4.8755 17.1871 10.2283 24.9516 19.9010 26.2841 60.0009 31.9728 18.7164 36.8768 6.2887 19.7912 27.8881 3.2107 88.8275 13.9086 7.7423 2.9957 0.1971 3.0704 3.9038 1.4701 3.7135 10.6074 0.0118 14.2546 9.8464 6.1602 21.9695 147.6562 27.0981 0.0268 3.7076 30.4827 147.2789 33.1136 33.0457 21.9496 23.6724 11.5941 2.3426 22.5351 15.7230 37.1125 26.0198 12.1439 18.0674 18.6624 12.4527 2.0443 13.6854 16.1102 4.8154 9.8408 12.5834 13.0603 11.0849 0.4826 21.0792 1.9736 10.4436 102.6921 4.8985 79.8846 39.9233 29.6561 33.5135 30.4886 60.8400 28.9292 21.9555 12.9869 1.0971 3.5964 37.2438 14.3400 37.2327 1.1983 80.2313
temp: 298.150 k
press: 1.00000 atm
elementType: 8 8 7 7 6 6 6 6 6 6 6 6 6 6 6 6 6 6 1 1 1 1 1 1 1 1 1 1 1 1 1 1 1 1
symmnumber: 1
zpe: 723761.0 jmol-1
zpe.correction: 0.275666 hartree
zpe.thermalcorrener: 0.291929 hartree
zpe.thermalcorrenthalpy: 0.292873 hartree
zpe.thermalcorrgfe: 0.232221 hartree
zpe.sumelectzpe: -801.735290 hartree
zpe.sumelectthermal: -801.719027 hartree
zpe.sumelectthermalent: -801.718082 hartree
zpe.sumelectthermalfe: -801.778734 hartree
dipole: 3.4807 0.1426 -0.9021
dipole: 3.5985
quadrupole: -92.4839 -101.0646 -105.2374
quadrupole: 0.7333 -3.0488 -3.3871
quadrupole: 7.1114 -1.4693 -5.6421 0.7333 -3.0488 -3.3871
hfenergy: -802.0109556 hartree
pointgroup: C01 [X(C14H16N2O2)]
dipole: -1.375107 0.0330086 0.3351814 debye
polarizability: 236.7392152|-5.6073795|166.3829208|14.7778932|9.9211791|113.3823711 unknown
InChI: InChI=1S/C14H16N2O2/c1-14(13(17)18-2)12-10(7-8-15-14)9-5-3-4-6-11(9)16-12/h3-6,15-16H,7-8H2,1-2H3
charge 0 multiplicity 1
34 atoms
O  -3.500526 -0.296617 0.747837
O  -2.198687 -2.129095 0.151345
N  -2.103906 1.499586 -0.794862
N  0.530818 -1.175213 -0.583436
C  -1.694933 0.086361 -0.8872
C  -0.228165 0.002452 -0.516043
C  0.569456 1.061936 -0.088901
C  -0.002082 2.440205 0.127607
C  -1.5323 2.302324 0.314593
C  1.900743 0.525548 0.117716
C  1.841598 -0.885609 -0.185426
C  -1.951039 -0.411616 -2.342677
C  -2.461764 -0.905022 0.053459
C  3.134198 1.087183 0.541256
C  2.967792 -1.728065 -0.066548
C  4.261192 0.249837 0.658422
C  4.178418 -1.142812 0.359482
C  -4.279997 -1.185467 1.650624
H  0.440427 2.917094 1.023985
H  0.204864 3.102057 -0.736404
H  -1.737663 1.853498 1.315249
H  -2.013632 3.296454 0.285348
H  -3.122159 1.598829 -0.873585
H  0.120967 -2.102086 -0.698769
H  -1.335701 0.191591 -3.028693
H  -1.696367 -1.479141 -2.455848
H  -3.015495 -0.276002 -2.61064
H  3.210107 2.155747 0.773081
H  2.910789 -2.797659 -0.297601
H  5.219695 0.669855 0.983669
H  5.072687 -1.768073 0.460977
H  -4.719281 -2.017791 1.076167
H  -5.057854 -0.538097 2.078071
H  -3.622001 -1.592791 2.435944
