program: Gaussian 09
title: 000149170
version: EM64L-G09RevD.01
frameworkgroup: C1[X(C21H21NO9)]
method: RPBEPBE
basis: SDD
operation: Freq
keyword: #p
keyword: freq=noraman
keyword: PBEPBE/SDD
title: #p freq=noraman PBEPBE/SDD
converged: YES YES NO NO
title: Mulliken charges:
elementType: O O O O O O O O O N C C C C C C C C C C C C C C C C C C C C C H H H H H H H H H H H H H H H H H H H H H
charge: -0.279629 -0.248322 -0.438334 -0.432859 -0.430998 -0.375432 -0.194516 -0.292478 -0.390592 -0.582845 -0.121557 -0.164025 -0.210455 -0.071911 0.023158 -0.352477 -0.429644 0.448728 0.290446 -0.616421 0.167561 -0.609653 0.188506 -0.286452 0.339325 0.011502 0.032731 0.139528 -0.421775 -0.353037 -0.191959 0.173408 0.276816 0.274080 0.213178 0.187209 0.205268 0.229384 0.263139 0.306342 0.362610 0.335814 0.262271 0.224404 0.352014 0.297939 0.340312 0.291444 0.262783 0.240157 0.368605 0.386709
chargesum: 0.00000
title: Mulliken charges with hydrogens summed into heavy atoms:
elementType: O O O O O O O O O N C C C C C C C C C C C C C C C C C C C C C
charge: -0.279629 -0.248322 -0.075724 -0.097045 -0.078984 -0.006828 -0.194516 -0.292478 -0.003883 -0.013364 0.051851 0.112790 0.063626 0.141267 0.210367 0.082175 0.057031 0.448728 0.290446 -0.318482 0.167561 -0.269341 0.188506 -0.286452 0.339325 0.011502 0.032731 0.139528 -0.130331 -0.090254 0.048198
polarizability: 4.30537990e+02 1.06030628e+01 2.89872273e+02 -4.74693037e+01 3.99983193e+00 1.66215903e+02
1716.lowfreq: -3.9337 -0.0006 -0.0005 0.0010 4.6547 5.6286 13.0092 16.7179 25.7013
frequency: 12.9898 16.5900 25.5350 38.1202 50.9293 60.3670 74.3361 96.4262 102.7880 111.7881 120.2048 133.6836 162.7702 179.1258 189.3435 190.7723 214.3792 223.3031 227.4164 237.6516 255.4451 265.6500 286.3438 293.7347 302.2488 308.5650 336.9507 345.1580 354.4238 365.1243 398.8133 407.4554 424.9748 428.2270 432.5165 435.6598 449.6365 455.6064 470.5870 477.5714 482.9160 500.8651 509.6963 533.9045 544.7643 552.2658 553.9019 571.2254 578.7456 589.2728 606.1526 641.9693 655.5794 659.5760 722.3868 726.4189 758.5647 781.6389 797.4819 804.8849 838.8640 855.2328 891.6012 906.6661 916.4052 923.5660 932.5426 935.4345 951.1343 955.7381 964.9604 970.9710 975.7213 994.8640 997.6258 1003.5247 1022.3962 1024.8412 1042.0902 1055.9863 1064.6484 1070.3236 1079.4735 1095.8559 1108.3500 1112.2434 1136.6139 1161.5851 1168.4904 1180.2169 1182.8523 1192.0075 1197.5263 1207.4164 1229.1809 1233.4841 1248.3328 1265.9033 1267.0026 1273.6417 1283.7233 1294.4611 1309.2131 1314.6918 1329.0110 1330.7628 1337.9012 1348.5556 1351.7759 1353.1718 1359.7174 1366.2876 1380.0945 1392.7242 1408.3929 1412.7262 1423.6139 1442.1098 1449.4343 1457.8202 1459.8347 1483.1302 1537.7651 1548.2867 1576.5705 1591.5373 1609.6812 1630.8150 1652.8540 2655.2667 2856.6486 2900.5044 2914.2599 2975.3610 2990.1424 3051.3833 3059.8124 3067.6117 3067.7340 3097.7595 3143.5287 3144.9037 3168.5274 3179.1936 3411.7846 3517.8211 3521.2781 3524.1907 3537.0883 3547.7190
redmass: 6.2078 5.8078 7.3477 6.3843 4.6495 6.6024 4.8164 4.9623 5.9198 4.9458 9.2958 6.8316 3.5710 3.9704 2.5432 2.2970 3.4361 3.9982 5.1632 4.9043 4.4191 3.5542 4.8148 5.2093 6.4288 4.7896 1.2281 5.0041 8.1937 4.2278 5.7613 4.7438 4.8567 2.8997 7.3060 4.5281 2.8494 3.8051 1.5489 1.6502 1.1566 4.3219 5.1582 8.0521 4.7207 5.7967 3.5380 5.0075 4.7665 3.0627 3.8699 5.7436 5.1776 4.5160 3.3903 6.2054 5.8715 1.5641 8.2815 1.8169 2.6204 2.7857 5.9828 2.1400 3.6051 3.5423 1.6025 4.9407 3.4276 1.7108 4.2696 3.3038 1.0653 3.2888 1.3743 4.8028 3.1618 2.1568 3.0094 2.8355 2.7466 2.3425 3.7660 3.2498 2.2736 2.9752 2.1862 1.3801 1.3568 1.2914 1.6423 1.3312 1.3387 1.3597 1.6190 1.4766 1.2680 1.2987 1.6729 1.1934 2.8845 2.9280 1.4634 1.7614 1.4229 2.5552 1.2596 1.3712 3.4516 1.2707 1.3924 1.4082 1.3162 1.4397 5.9944 4.4351 4.5037 2.9149 3.6126 1.0879 1.0847 3.6670 4.3781 6.3363 3.9226 5.9665 5.5743 6.1004 1.0878 1.0714 1.0811 1.0832 1.0820 1.0683 1.0614 1.0855 1.1013 1.0891 1.0917 1.0957 1.0917 1.0878 1.0925 1.0983 1.0476 1.0656 1.0654 1.0658 1.0929 1.0654
irintensity: 0.7487 1.6674 0.0507 2.4395 2.6566 1.9167 5.6124 4.5716 3.8506 1.0947 1.0462 0.8605 1.5988 3.5038 19.0457 17.0539 3.7915 3.8709 6.2483 0.5689 10.1461 6.6504 10.2831 10.0141 3.2612 3.0219 59.0075 3.5418 8.3431 11.6360 11.2854 7.9284 28.5354 38.9384 0.8021 6.8635 80.3938 16.4791 216.5892 42.7696 183.4682 5.4066 5.5593 3.6603 6.5164 3.2070 23.1073 2.7077 1.2128 8.3954 26.4717 0.9495 7.7706 15.5674 2.4504 4.8187 11.3649 302.1196 20.9918 57.0098 17.7917 1.5615 16.7395 5.4068 140.2128 43.7965 5.8085 366.6030 33.5390 2.5690 127.8085 31.2336 127.4756 4.7182 1.5234 16.2033 57.3911 9.3115 5.4362 89.7669 158.9480 60.9903 0.8263 20.4767 21.4897 95.7069 9.1968 15.7391 18.0376 3.3436 25.4526 64.2857 35.5836 9.1081 53.9723 37.9475 2.2014 36.1406 78.8777 22.2857 282.6076 187.0001 78.2895 237.9893 51.6625 103.3320 7.0554 8.7963 71.9459 11.2917 41.3072 5.2659 20.2784 9.7119 12.7871 6.9992 53.2658 28.3150 207.4943 24.6996 4.2338 45.3462 75.6958 149.0744 41.7895 50.8874 47.7600 38.9741 41.7544 228.7996 47.9726 46.0318 56.3063 55.0749 18.5682 5.7244 7.6290 56.8259 44.5145 17.6557 2.4301 11.3838 0.6165 15.5659 3.4695 48.6239 29.3559 1.6019 6.5564 8.4303
temp: 298.150 k
press: 1.00000 atm
elementType: 8 8 8 8 8 8 8 8 8 7 6 6 6 6 6 6 6 6 6 6 6 6 6 6 6 6 6 6 6 6 6 1 1 1 1 1 1 1 1 1 1 1 1 1 1 1 1 1 1 1 1 1
symmnumber: 1
zpe: 1034410.4 jmol-1
zpe.correction: 0.393986 hartree
zpe.thermalcorrener: 0.422189 hartree
zpe.thermalcorrenthalpy: 0.423133 hartree
zpe.thermalcorrgfe: 0.333801 hartree
zpe.sumelectzpe: -1542.308503 hartree
zpe.sumelectthermal: -1542.280300 hartree
zpe.sumelectthermalent: -1542.279356 hartree
zpe.sumelectthermalfe: -1542.368688 hartree
dipole: -3.8182 -1.1947 -1.3652
dipole: 4.2273
quadrupole: -185.8319 -197.4022 -174.8028
quadrupole: 24.4934 4.5723 2.9626
quadrupole: 0.1804 -11.3899 11.2095 24.4934 4.5723 2.9626
hfenergy: -1542.702489 hartree
pointgroup: C01 [X(C21H21N1O9)]
dipole: -1.5096784 0.6427426 0.2716446 debye
polarizability: 428.4828628|10.7427299|272.7292489|52.7080624|-42.6372381|185.4140548 unknown
InChI: InChI=1S/C21H21NO9/c22-16-20(29)18(27)13(6-23)31-21(16)30-7-8-4-10-15(12(25)5-8)19(28)14-9(17(10)26)2-1-3-11(14)24/h1-5,13,16,18,20-21,23-25,27,29H,6-7,22H2
charge 0 multiplicity 1
52 atoms
O  -4.480876 -1.188176 -0.077176
O  -2.799851 -0.877367 -1.652113
O  -5.902085 2.689619 -0.763398
O  -7.064655 1.146373 1.408355
O  -5.40376 -2.919444 1.976308
O  1.030088 2.32814 -1.699836
O  2.841809 -2.89575 0.924835
O  3.543279 2.317454 -0.769321
O  5.896363 2.335558 0.09312
N  -3.16521 2.070279 -1.548428
C  -5.176141 1.600614 -0.113283
C  -4.16278 1.050301 -1.146774
C  -6.145498 0.532768 0.423293
C  -5.353336 -0.657327 0.996385
C  -3.474805 -0.216907 -0.582864
C  -6.224771 -1.84318 1.424543
C  -1.710316 -1.776029 -1.234917
C  -0.408189 -1.022815 -0.994206
C  1.895995 -0.957714 -0.162197
C  0.68315 -1.650778 -0.350688
C  2.059799 0.398603 -0.607826
C  -0.273032 0.305495 -1.437309
C  0.939951 1.014319 -1.251021
C  3.006217 -1.695989 0.530961
C  4.293741 -0.977504 0.738881
C  4.439719 0.370225 0.287487
C  3.345961 1.092193 -0.387431
C  5.693778 1.04324 0.501469
C  5.35941 -1.638174 1.382995
C  6.760195 0.363656 1.152432
C  6.588571 -0.96194 1.586078
H  -4.600845 1.99666 0.764051
H  -4.718618 0.733978 -2.048074
H  -6.816053 0.192588 -0.385032
H  -4.723639 -0.328647 1.857993
H  -2.782158 0.037165 0.255964
H  -6.81574 -2.189138 0.550523
H  -6.914939 -1.542114 2.22824
H  -2.860261 2.640693 -0.746385
H  -3.548784 2.685908 -2.275716
H  -6.692361 2.897221 -0.197512
H  -6.556183 1.370817 2.231865
H  -1.597713 -2.48063 -2.077825
H  -2.006274 -2.359677 -0.341061
H  -4.738555 -3.163456 1.281697
H  0.624004 -2.681059 0.01697
H  -1.137945 0.801811 -1.903828
H  5.209887 -2.669677 1.714274
H  7.700622 0.90241 1.29962
H  7.416244 -1.475677 2.086298
H  0.172856 2.590569 -2.128193
H  5.00393 2.643414 -0.353421
