program: Gaussian 09
title: 000149062
version: EM64L-G09RevD.01
frameworkgroup: C1[X(C9H12N4O)]
method: RPBEPBE
basis: SDD
operation: Freq
keyword: #p
keyword: freq=noraman
keyword: PBEPBE/SDD
title: #p freq=noraman PBEPBE/SDD
converged: NO YES NO NO
title: Mulliken charges:
elementType: O N N N N C C C C C C C C C H H H H H H H H H H H H
charge: -0.260577 -0.131384 -0.076574 -0.054297 -0.076233 -0.401394 -0.425947 -0.404352 -0.402875 0.201168 -0.122833 -0.453068 0.221922 -0.509966 0.239718 0.252706 0.237845 0.241532 0.238843 0.246376 0.240033 0.238748 0.259584 0.227540 0.239782 0.233702
chargesum: 0.00000
title: Mulliken charges with hydrogens summed into heavy atoms:
elementType: O N N N N C C C C C C C C C
charge: -0.260577 -0.131384 -0.076574 -0.054297 -0.076233 0.091030 0.053431 0.080867 0.075905 0.201168 -0.122833 -0.193483 0.221922 0.191057
polarizability: 1.80680206e+02 9.88478337e-01 1.57666187e+02 -5.13734640e+00 -2.69900600e+00 7.28506012e+01
1716.lowfreq: 0.0004 0.0007 0.0008 2.1281 8.4783 10.7674 58.8772 67.5098 79.9248
frequency: 58.8670 67.5058 79.9156 109.1490 136.7731 145.4015 152.2582 162.7431 223.2006 242.3862 247.8039 278.6762 376.3168 418.3051 462.4505 471.4949 541.7427 648.5320 660.5613 670.3951 747.5299 770.6373 792.7721 798.2810 826.0856 830.5332 895.4173 909.6066 918.0962 932.7378 990.5882 993.4410 1010.9976 1026.9263 1087.8475 1094.5221 1097.8617 1099.1531 1112.6788 1115.5483 1121.0356 1124.3222 1137.2899 1141.3311 1152.0271 1232.2770 1270.5815 1298.2111 1342.3571 1416.8201 1439.8829 1448.8229 1462.2163 1464.9945 1465.9209 1476.9378 1478.9849 1496.5031 1523.5138 1550.8504 3000.0418 3069.2621 3075.8208 3083.7005 3084.6393 3100.6315 3138.9329 3175.6448 3178.2902 3194.3968 3194.5006 3200.3324
redmass: 3.0839 2.9477 3.3764 3.2669 2.7166 1.3280 3.1006 2.6409 4.5107 3.2360 5.6574 5.0016 4.6045 4.6584 5.6683 6.3716 5.7226 5.0827 9.6610 3.9118 5.4409 4.0436 1.0647 1.0695 4.5687 1.9306 6.5622 5.9750 7.7203 5.6290 1.5096 1.1784 1.6729 2.5896 1.2992 1.3068 1.3281 1.3249 1.2545 1.3964 1.5564 1.9883 1.4361 1.5024 1.5856 4.0686 3.7670 10.7028 3.5050 2.4155 2.1361 1.0532 1.0789 1.0762 1.0769 1.3361 1.2251 4.0185 8.7959 6.3342 1.0291 1.0515 1.0483 1.0600 1.0575 1.1042 1.1049 1.1181 1.1187 1.1176 1.1175 1.0939
irintensity: 3.5816 3.3749 9.5404 4.4028 3.9971 0.1337 3.0776 2.0252 7.5344 8.8360 4.9456 30.8915 11.4593 7.0984 4.5434 4.0638 6.5069 1.8699 3.0303 4.5804 14.3977 18.1509 26.7603 27.8239 1.9606 39.1357 1.3503 5.2655 2.3576 2.6967 35.4416 12.5455 20.4527 61.2364 8.6575 3.0412 5.7523 5.9955 0.5627 3.9229 46.5377 88.5737 7.2624 6.0389 54.4376 45.6769 108.5347 47.4187 76.6918 291.4291 337.5136 12.5741 5.3594 7.2674 43.1148 16.9668 75.4125 36.7712 494.7475 832.0672 51.3198 29.7292 20.3463 51.8363 33.5442 30.5969 27.5065 5.4826 1.4964 33.4310 28.8812 0.1831
temp: 298.150 k
press: 1.00000 atm
elementType: 8 7 7 7 7 6 6 6 6 6 6 6 6 6 1 1 1 1 1 1 1 1 1 1 1 1
symmnumber: 1
zpe: 536805.2 jmol-1
zpe.correction: 0.204458 hartree
zpe.thermalcorrener: 0.217844 hartree
zpe.thermalcorrenthalpy: 0.218788 hartree
zpe.thermalcorrgfe: 0.163900 hartree
zpe.sumelectzpe: -643.235861 hartree
zpe.sumelectthermal: -643.222475 hartree
zpe.sumelectthermalent: -643.221531 hartree
zpe.sumelectthermalfe: -643.276419 hartree
dipole: 0.0355 -0.4293 0.0821
dipole: 0.4385
quadrupole: -64.1717 -76.1902 -84.4004
quadrupole: 1.0625 4.4677 2.4329
quadrupole: 10.7490 -1.2694 -9.4796 1.0625 4.4677 2.4329
hfenergy: -643.4403189 hartree
pointgroup: C01[X(C9H12N4O1)]
dipole: 0.1149169 0.1269231 -0.0212185 debye
dipolederiv: -1.7540165 -0.1962198 -0.0093993 -0.3756639 -0.4590291 -0.0110037 -0.0139287 0.0086634 -0.3221589 -1.4681132 0.8369881 0.2255155 0.8214876 -0.5848733 -0.0550992 -0.2745124 0.2208117 -0.444974 -0.085877 -0.0908027 -0.0139491 -0.0387865 -2.0229456 -0.228407 -0.0126388 0.3637398 -0.4537298 -0.7086348 0.5918451 0.0448792 0.3449932 -1.4129908 -0.0996391 -0.0033311 0.027195 -0.2136292 -0.8076382 -0.5030683 -0.0171954 -0.2915015 -1.2860257 -0.0713478 -0.0161026 0.0361644 -0.1971583 0.3990473 -0.0998294 0.0223065 -0.0635898 0.05157 -0.0097488 0.0574255 -0.0278123 0.2242842 0.2084843 -0.2533836 -0.0290146 -0.276081 0.2592316 -0.0261692 0.0323007 -0.0308754 0.2520406 0.0671284 0.171084 -0.0135539 0.1169658 0.4094351 -0.0061029 -0.0074478 -0.0539573 0.2408264 0.0442482 -0.1334223 0.013266 -0.103869 0.4573923 -0.0061498 -0.0014885 -0.0607583 0.2462984 1.7932477 -0.6958795 -0.0744768 -0.5034285 1.182792 0.0399642 0.2451801 -0.1937916 0.0910168 0.7234902 0.0050761 0.0134147 0.0349692 2.3805365 0.1075293 0.0360935 -0.350161 0.1166259 -1.2693897 0.1865509 0.0432901 0.0695285 -0.3220524 -0.0473085 -0.0141178 -0.0189716 -0.2162297 1.9158087 0.2032518 0.0008431 0.3469593 1.0644061 0.0274808 0.0274082 -0.0425283 0.1798011 0.8106699 0.0047049 0.0106279 -0.2261514 0.241068 0.0000317 0.0169911 0.0048149 0.2692343 -0.1116019 -0.0039362 -0.053976 -0.0764236 0.0982267 0.0220572 -0.1041155 0.0146616 0.0481924 0.0276989 0.0055728 -0.0363746 -0.031635 0.0270172 0.1101113 0.070266 0.0591864 -0.0036587 0.0256081 0.0113801 -0.1144774 0.0249765 0.0310057 -0.0209597 0.0014664 -0.1042766 -0.063015 0.0941027 0.045907 -0.0303923 0.1175245 -0.1220956 0.010068 -0.043464 0.0565564 0.0485914 -0.0069394 -0.1621618 0.0076011 -0.0829299 -0.0074885 0.048171 0.0425 0.0875275 0.0448674 0.0281863 -0.0240032 -0.0722916 0.007094 0.0281826 0.089955 -0.0859783 -0.0402921 -0.030716 0.0294323 0.0226048 0.0859026 -0.0059603 0.0165408 0.0825325 0.0927127 -0.0546205 -0.0405018 0.0138749 0.1621888 0.0001361 0.0868039 -0.0370954 0.0459627 -0.0318163 0.0887011 0.0450527 0.1104221 0.0056938 -0.0063818 -0.0016745 -0.0413929 0.0043709 -0.0123527 0.0191757 0.1890105 -0.1028434 -0.088251 -0.0041943 -0.157397 -0.0061669 -0.0038095 -0.0041278 -0.0020777 0.1203721 0.0143595 -0.0033272 0.0281647 0.1265444 0.032359 0.0984543 -0.0243111 0.089001 -0.0642228 0.0092445 0.0014369 -0.0202703 0.1372449 0.0223925 -0.1009437 0.0273891 -0.0960763 -0.06622 unknown
polarizability: 170.8126035|-11.3763107|167.3331679|-2.7606466|6.8037768|73.0512237 unknown
InChI: InChI=1S/C9H12N4O/c1-14-8-6-7(12-2-3-12)10-9(11-8)13-4-5-13/h6H,2-5H2,1H3
charge 0 multiplicity 1
26 atoms
O  -2.556191 -1.396784 0.005866
N  2.268886 -1.621938 0.223294
N  0.058906 2.525348 -0.197774
N  1.164652 0.458651 0.019584
N  -1.277606 0.592368 -0.029262
C  3.508834 -1.32899 -0.531131
C  2.772129 -2.664412 -0.713423
C  0.891776 3.437544 0.614697
C  -0.644935 3.529884 0.629507
C  1.068823 -0.911031 0.069821
C  -0.016822 1.139373 -0.040009
C  -0.175854 -1.588871 0.04716
C  -1.324005 -0.764641 0.005561
C  -3.750868 -0.52804 -0.048388
H  4.428034 -1.293855 0.061726
H  3.441136 -0.588277 -1.336205
H  2.222948 -2.812877 -1.652303
H  3.168958 -3.573913 -0.251668
H  1.475014 4.175728 0.05552
H  1.391987 3.012708 1.493033
H  -1.170298 3.167952 1.521614
H  -1.148777 4.333019 0.082918
H  -0.255696 -2.675387 0.089114
H  -4.595926 -1.231678 -0.06734
H  -3.733546 0.102014 -0.953578
H  -3.797159 0.125906 0.838965
