program: Gaussian 09
title: 000008881
version: EM64L-G09RevD.01
frameworkgroup: C1[X(C3H6Cl2)]
method: RPBEPBE
basis: SDD
operation: Freq
keyword: #pfreq=noraman
keyword: PBEPBE/SDD
title: #p freq=noraman PBEPBE/SDD
converged: NO YES NO NO
title: Mulliken charges:
elementType: Cl Cl C C C H H H H H H
charge: -0.078654 -0.078674 -0.326991 -0.543287 -0.543304 0.236683 0.236682 0.269842 0.278922 0.278922 0.269860
chargesum: 0.00000
title: Mulliken charges with hydrogens summed into heavy atoms:
elementType: Cl Cl C C C
charge: -0.078654 -0.078674 0.146373 0.005476 0.005478
polarizability: 5.58239884e+01 1.28201537e-04 4.48528221e+01 -7.07389519e+00 -1.47231408e-03 4.35670767e+01
1716.lowfreq: -19.8001 -6.2419 0.0029 0.0036 0.0055 17.5155 60.3427 167.8060 208.2762
frequency: 60.3003 167.7970 208.2757 345.5664 436.3653 587.3817 623.3162 800.8839 875.2999 967.7996 998.5097 1104.0315 1128.0652 1134.1887 1252.1880 1279.7705 1316.3240 1362.8324 1429.9081 1447.3737 1449.4722 2983.3124 3038.1965 3061.6999 3063.3250 3145.2203 3146.4965
redmass: 9.7272 2.9420 3.7938 2.2237 2.6158 3.9501 5.2963 1.4067 2.5395 1.5440 1.6518 1.9407 1.2367 1.0597 1.2298 1.2085 1.1595 1.5484 1.0841 1.0910 1.0998 1.0597 1.0944 1.0576 1.0621 1.1112 1.1117
irintensity: 2.7082 7.9624 4.7759 5.2400 0.9028 23.9461 16.5068 41.0283 14.3444 14.0035 0.7324 3.5349 1.5459 0.9740 0.0428 36.1987 10.2123 4.0791 17.7715 23.4421 2.2834 14.2998 4.0134 1.4862 44.2253 4.6589 10.6173
temp: 298.150 k
press: 1.00000 atm
elementType: 17 17 6 6 6 1 1 1 1 1 1
symmnumber: 1
zpe: 223784.8 jmol-1
zpe.correction: 0.085235 hartree
zpe.thermalcorrener: 0.091347 hartree
zpe.thermalcorrenthalpy: 0.092291 hartree
zpe.thermalcorrgfe: 0.053945 hartree
zpe.sumelectzpe: -1037.623319 hartree
zpe.sumelectthermal: -1037.617207 hartree
zpe.sumelectthermalent: -1037.616263 hartree
zpe.sumelectthermalfe: -1037.654609 hartree
dipole: -0.0002 2.6656 0.0004
dipole: 2.6656
quadrupole: -52.7943 -43.1722 -41.5280
quadrupole: -0.0004 2.3179 -0.0008
quadrupole: -6.9628 2.6593 4.3035 -0.0004 2.3179 -0.0008
hfenergy: -1037.7085537 hartree
pointgroup: C01 [X(C3H6Cl2)]
dipole: -0.0000151 1.0487242 -0.003465 debye
dipolederiv: -0.3935076 0.1470393 0.0772458 0.1694866 -0.3225503 -0.0810526 0.1432841 -0.1313313 -0.29498 -0.3935162 -0.1465447 0.0782058 -0.1685683 -0.3212083 0.081235 0.1443688 0.1315073 -0.296386 -0.0880907 -0.000039 -0.0144314 0.0003021 -0.0795788 0.0001382 0.0898506 0.0001829 -0.0459872 0.4198952 -0.2113498 -0.2104674 -0.2732581 0.3525759 0.190459 -0.2115672 0.1765838 0.3156057 0.4198741 0.2100119 -0.2118167 0.2719172 0.3502488 -0.1907118 -0.2133543 -0.1768297 0.3179885 0.0077756 0.1030098 0.0558304 0.0775934 0.0217783 -0.0873984 -0.0145356 -0.0933555 0.0072861 0.0077991 -0.1026604 0.0565412 -0.0777135 0.0229472 0.0872777 -0.0140329 0.093229 0.0060616 -0.0569936 -0.0204009 -0.0331645 -0.0283905 -0.000898 -0.1145765 -0.0344027 -0.0913053 0.0037516 0.066895 -0.0083596 0.1177336 0.042473 -0.0116846 0.0334895 0.0723499 0.0253218 -0.0080723 0.0668783 0.0090968 0.1176526 -0.0419958 -0.0120565 -0.033436 0.0726273 -0.0253104 -0.0076922 -0.0570093 0.0201965 -0.0333295 0.028154 0.0004263 0.1145759 -0.034588 0.0913074 0.0024243 unknown
polarizability: 53.7426449|-0.0258568|44.8528356|-8.4390864|0.00339|45.6484067 unknown
InChI: InChI=1S/C3H6Cl2/c4-2-1-3-5/h1-3H2
charge 0 multiplicity 1
11 atoms
Cl 2.098231 -0.73502 -0.487018
Cl -2.096893 -0.732139 0.492289
C  0.000617 1.093092 -0.003262
C  1.052406 0.267378 0.738202
C  -1.051104 0.262369 -0.739415
H  -0.49807 1.752995 0.734882
H  0.499307 1.747992 -0.745796
H  1.770593 0.901289 1.278282
H  0.595867 -0.475754 1.409183
H  -0.594601 -0.485055 -1.405673
H  -1.769453 0.892654 -1.283474
