program: Gaussian 09
title: 000149035
version: EM64L-G09RevD.01
frameworkgroup: C1[X(C6H14N2O2)]
method: RPBEPBE
basis: SDD
operation: Freq
keyword: #p
keyword: freq=noraman
keyword: PBEPBE/SDD
title: #p freq=noraman PBEPBE/SDD
converged: YES YES NO NO
title: Mulliken charges:
elementType: O O N N C C C C C C H H H H H H H H H H H H H H
charge: -0.271316 -0.283721 -0.115361 0.063883 0.004024 -0.378964 -0.734839 -0.709593 -0.274622 -0.490968 0.262288 0.236541 0.190951 0.223882 0.229201 0.239380 0.214568 0.243658 0.216265 0.252738 0.221409 0.203735 0.216183 0.240678
chargesum: 0.00000
title: Mulliken charges with hydrogens summed into heavy atoms:
elementType: O O N N C C C C C C
charge: -0.271316 -0.283721 -0.115361 0.063883 0.266311 0.048528 -0.042376 -0.035102 0.199525 0.169629
polarizability: 1.00382072e+02 1.49351210e+00 9.92163122e+01 2.30291969e+00 -8.15216907e-01 6.84447106e+01
1716.lowfreq: -37.0028 -18.2504 -9.0905 0.0003 0.0009 0.0011 14.3168 44.4176 72.9889
frequency: -22.0146 44.2433 72.9135 104.9696 127.5153 182.1651 200.4908 218.9312 240.6939 252.7178 271.5121 337.7184 352.2716 372.1704 429.6308 479.8159 577.4252 631.4424 766.9219 784.9126 857.1152 882.0566 927.2429 975.4958 989.3754 1009.2807 1033.4200 1075.6312 1107.8250 1115.5573 1130.5569 1151.4448 1164.0358 1204.3838 1255.7672 1293.8016 1318.3061 1331.6421 1352.1114 1358.4460 1383.2540 1386.3631 1387.3407 1436.2117 1458.4177 1460.4609 1464.3231 1469.2882 1478.3494 1482.0227 1488.4301 1494.7724 2934.8211 2954.5135 2981.0387 2986.2179 2991.5876 2998.9408 3010.1408 3015.2145 3057.6218 3078.2749 3088.9880 3093.4656 3094.8634 3113.6290
redmass: 3.2532 3.3826 2.4802 2.6977 3.1555 1.3695 1.5224 1.7114 2.2265 1.4471 3.5413 3.1623 2.2650 3.5834 3.3831 3.6184 4.8581 2.5370 1.2502 3.1853 2.8754 5.8290 2.5798 2.0093 1.4797 1.4140 7.6021 1.9812 2.1748 1.4278 1.8111 1.4868 1.9325 2.2492 1.3081 1.3230 1.8248 1.6719 1.6902 1.3656 1.2545 1.6029 1.3079 1.1389 1.0522 1.0616 1.0714 1.0497 1.0592 1.0565 1.0533 1.0535 1.0350 1.0545 1.0777 1.0363 1.0369 1.0693 1.1037 1.1037 1.0965 1.0985 1.0992 1.1004 1.1006 1.0979
irintensity: 0.7579 2.5835 9.8469 0.5631 1.9589 1.3602 1.0274 2.6612 4.0672 0.6699 1.3235 1.8591 1.1118 1.8788 5.2069 1.8888 14.3287 7.0846 4.7495 3.0425 2.8783 25.2927 90.1447 57.8963 1.5201 10.1237 165.1571 32.3150 46.8405 5.6137 2.4516 16.0493 24.1142 38.8538 4.5770 6.6756 33.8777 47.8336 30.0058 6.9009 18.1994 8.1287 34.9644 0.2613 9.4497 7.9535 24.5132 5.7494 23.7043 5.9603 8.7923 9.2406 71.2670 56.2338 3.2476 28.0568 28.5172 36.9620 54.9101 24.1718 4.8549 52.1207 18.5685 45.9934 29.1054 23.3837
temp: 298.150 k
press: 1.00000 atm
elementType: 8 8 7 7 6 6 6 6 6 6 1 1 1 1 1 1 1 1 1 1 1 1 1 1
symmnumber: 1
zpe: 530965.6 jmol-1
zpe.correction: 0.202234 hartree
zpe.thermalcorrener: 0.213917 hartree
zpe.thermalcorrenthalpy: 0.214861 hartree
zpe.thermalcorrgfe: 0.164561 hartree
zpe.sumelectzpe: -496.061694 hartree
zpe.sumelectthermal: -496.050011 hartree
zpe.sumelectthermalent: -496.049067 hartree
zpe.sumelectthermalfe: -496.099367 hartree
dipole: -1.3591 -4.0418 -1.1850
dipole: 4.4258
quadrupole: -52.1132 -71.1158 -61.0700
quadrupole: -0.6258 3.1368 0.0896
quadrupole: 9.3198 -9.6828 0.3630 -0.6258 3.1368 0.0896
hfenergy: -496.2639281 hartree
pointgroup: C01 [X(C6H14N2O2)]
dipole: 0.6246646 1.5777612 -0.3904078 debye
dipolederiv: -1.0642895 -0.1709022 -0.0505846 -0.1298836 -0.4075348 0.006523 -0.2163188 0.0004254 -0.4328421 -0.2899613 0.568584 0.0670619 -0.1241269 -1.1181 -0.0118411 0.0268685 -0.3389299 -0.2325866 -0.5323737 -0.4541928 0.0003924 -0.0327935 -0.9114733 -0.0409635 0.0428364 0.3346281 -0.2341845 0.0347683 -0.015762 -0.0593895 0.2842073 1.5849751 0.0194355 -0.0157521 0.0936657 -0.0494578 0.2879053 -0.2613021 -0.0340472 -0.2453484 0.4506346 0.0671825 -0.0237406 0.040522 0.2608483 0.0830291 -0.0038334 0.0138676 -0.0274847 0.089238 0.0251689 0.0167885 0.0450529 0.078848 0.0119143 0.0331605 0.0495556 0.0189962 -0.0863812 0.0606879 0.0485212 0.0582142 -0.0063866 -0.0591127 -0.0116758 -0.0445109 -0.0099125 0.0557216 -0.0316332 -0.0448096 -0.0534786 -0.0160809 0.8476928 0.2742186 0.1379569 0.1058454 0.2242879 -0.0258625 0.3465098 -0.1049408 0.5520589 0.7391761 0.0428974 -0.0223536 0.0007217 0.3117517 -0.04845 -0.1634801 -0.0944261 0.2463577 0.0047205 0.0236682 -0.0822053 0.0211617 -0.0284148 -0.0216805 -0.0542931 -0.0585998 -0.0711502 0.0540544 -0.0202571 -0.0243358 -0.0461902 -0.0179392 0.1337978 -0.0436819 0.1007781 -0.0238058 -0.0060313 0.0519481 0.0213987 0.078514 -0.0987183 -0.1494573 0.0041272 -0.1079797 0.0016344 0.0263813 0.1335762 0.0444358 0.1044178 -0.0612737 -0.05198 0.0556272 -0.0781235 0.0532285 0.0743957 -0.0165587 -0.0796139 -0.0279231 0.0675865 -0.0605047 -0.0739557 -0.0095194 -0.0956687 -0.130506 -0.1040549 0.0420854 -0.0792283 0.0898494 0.0220223 0.0301576 0.0238505 0.0653057 0.0975003 -0.0168369 -0.0001634 0.0274815 -0.0694236 0.1317263 -0.0310456 0.1134706 -0.0428461 0.1233198 0.055791 0.0395445 0.0283345 -0.0476301 -0.1035295 0.0372414 -0.0872322 0.0137818 -0.1896635 -0.0313442 0.0563285 -0.0380288 0.0921289 0.0104019 0.0855547 0.0158578 0.0598776 0.0257902 0.0430131 -0.0013061 0.1181542 0.0005581 -0.0972443 -0.0509517 -0.0152695 0.0374137 -0.0254694 -0.0913391 -0.0161342 -0.0653094 -0.0266974 0.1494001 -0.0907283 0.0743078 -0.1085577 -0.0246988 -0.0060227 -0.0068966 -0.042578 -0.0306867 0.1334587 0.1226218 0.1625431 -0.0979572 -0.0648674 0.0325691 0.0126401 0.1489099 -0.1397516 -0.0466078 0.0986918 -0.0448557 0.0750676 -0.0236746 -0.0553442 -0.0637263 -0.0679369 0.0772929 -0.0700506 -0.1067886 -0.069961 -0.0328979 unknown
polarizability: 100.5204919|1.5462526|98.867057|-2.4067753|2.4997427|68.6555459 unknown
InChI: InChI=1S/C6H14N2O2/c1-4-6(2)8(7-9)5-10-3/h6H,4-5H2,1-3H3
charge 0 multiplicity 1
24 atoms
O  2.206462 0.358678 0.449389
O  0.109482 -2.554106 -0.358753
N  0.018438 -0.297457 -0.161439
N  -0.582078 -1.544324 0.030974
C  -0.6815 0.894515 0.420219
C  -2.153021 0.589219 0.802193
C  -0.551667 2.103449 -0.534497
C  -3.112015 0.31278 -0.375741
C  1.388242 -0.177287 -0.647595
C  3.618499 0.451255 0.067542
H  -0.132967 1.139509 1.352385
H  -2.176972 -0.2657 1.500168
H  -2.508245 1.475334 1.365354
H  -1.1305 2.949615 -0.123521
H  -0.946243 1.873189 -1.539298
H  0.497589 2.432414 -0.629263
H  -3.146963 1.157598 -1.087151
H  -2.81337 -0.596712 -0.924438
H  -4.138513 0.154094 0.001549
H  1.716594 -1.1953 -0.940651
H  1.432959 0.507647 -1.519714
H  3.762562 1.124581 -0.804328
H  4.038567 -0.546898 -0.173858
H  4.141361 0.868206 0.941676
