program: Gaussian 09
title: 000149069
version: EM64L-G09RevD.01
frameworkgroup: C1[X(C19H32O5)]
method: RPBEPBE
basis: SDD
operation: Freq
keyword: #pfreq=noraman
keyword: PBEPBE/SDD
title: #p freq=noraman PBEPBE/SDD
converged: YES YES NO NO
title: Mulliken charges:
elementType: O O O O O C C C C C C C C C C C C C C C C C C C H H H H H H H H H H H H H H H H H H H H H H H H H H H H H H H H
charge: -0.250266 -0.226217 -0.399732 -0.183706 -0.253231 -0.389264 -0.386996 -0.386980 -0.379855 -0.386371 -0.472411 -0.384945 -0.164006 -0.382097 -0.372904 0.514444 -0.353292 -0.238273 -0.356771 -0.513474 0.179571 -0.696395 0.313503 -0.754084 0.197279 0.195911 0.193880 0.198051 0.194393 0.194411 0.194192 0.222891 0.194234 0.194440 0.203133 0.241542 0.193323 0.193096 0.273590 0.192144 0.192220 0.189508 0.189313 0.187677 0.187754 0.237613 0.194616 0.194886 0.312176 0.209743 0.215260 0.209642 0.375577 0.247384 0.245985 0.257889
chargesum: 0.00000
title: Mulliken charges with hydrogens summed into heavy atoms:
elementType: O O O O O C C C C C C C C C C C C C C C C C C C
charge: -0.250266 -0.226217 -0.024155 -0.183706 -0.253231 0.003926 0.004935 0.001825 0.037228 0.002303 -0.027736 0.001474 0.109584 0.002266 0.005917 0.514444 0.022138 -0.000661 0.032731 -0.201298 0.179571 -0.061749 0.313503 -0.002826
polarizability: 2.93958440e+02 7.14879746e+00 1.99731373e+02 1.88705458e+01 -1.94146918e+00 1.82958341e+02
1716.lowfreq: -23.3438 -0.8346 -0.0018 0.0012 0.0016 5.6161 7.9866 12.3767 17.7883
frequency: -22.0883 12.1615 17.7126 23.9258 33.6514 44.7789 51.2476 56.7868 62.8074 66.7615 79.4420 90.7034 92.7594 98.5364 114.3212 122.8655 125.7560 129.6392 145.0663 151.7500 156.2288 168.0993 192.6383 205.8107 233.3080 239.0289 262.7111 271.0472 310.3705 328.7552 332.7416 379.3631 409.7555 417.5947 447.9522 473.2338 487.5539 497.2941 537.9784 564.5509 589.6947 632.3638 673.2259 694.2093 703.5086 717.5558 719.8798 724.3788 732.0768 746.2835 770.3300 802.6039 804.6289 844.0280 870.8893 887.1882 888.3921 897.4740 901.5314 905.9079 940.0225 978.7904 985.1556 988.3545 991.4389 1012.6608 1019.8547 1027.2480 1030.6040 1043.0079 1044.2632 1060.9559 1073.2605 1077.5969 1081.0786 1082.4746 1086.4688 1090.3026 1123.1561 1143.9779 1176.4169 1179.3238 1184.0790 1195.3092 1200.1904 1204.7684 1223.8964 1230.1510 1245.6341 1254.7584 1263.5028 1274.1166 1278.1876 1278.9155 1284.5222 1288.1426 1291.6618 1294.9243 1296.4043 1297.9489 1306.9919 1318.8582 1329.0196 1339.0828 1350.7508 1353.4688 1356.7153 1359.4705 1368.7577 1383.5497 1388.1822 1399.9002 1451.9597 1453.2113 1454.2176 1458.3035 1458.5426 1461.6689 1462.5073 1464.5665 1467.9193 1473.0783 1477.1527 1478.3734 1483.1470 1487.0065 1488.6375 1644.7216 1646.3747 1709.2493 2948.2739 2948.4997 2950.0236 2950.8290 2951.9744 2954.5298 2958.9181 2963.2296 2966.9799 2968.0160 2971.1808 2974.3350 2980.8521 2983.9709 2988.3552 2990.0846 2994.3646 3002.3470 3007.2805 3012.3402 3019.1722 3023.3592 3031.3003 3036.4379 3041.9242 3055.8022 3067.8406 3069.9651 3099.1980 3142.6862 3224.7793 3554.1895
redmass: 1.7339 3.9953 5.3013 4.6687 4.0338 4.6795 5.1319 2.1012 1.5843 1.8943 2.4686 2.6138 3.0930 2.1005 6.0278 2.2707 5.2441 2.1996 2.2010 2.5543 2.9538 3.2007 5.9768 2.9315 1.1361 3.6909 4.2479 5.1014 2.4077 2.8847 1.9595 3.3630 3.2426 3.2465 4.1065 3.9808 3.3695 3.8365 3.7317 3.1998 5.0652 5.3403 5.6539 5.4652 6.6689 1.0589 1.0664 1.0948 1.2068 1.3171 1.3825 2.3017 2.3871 1.3931 3.8844 1.5729 1.7149 7.7177 4.6068 1.4447 1.3091 3.9128 2.3071 1.7726 2.1436 3.0388 4.8849 1.2536 3.5745 1.8154 2.2589 2.5283 2.7384 2.2941 2.1485 2.1765 2.6616 3.3534 2.8920 1.7257 1.6727 1.2486 1.7608 2.4680 1.4204 1.6230 1.3936 1.4216 1.4711 1.3212 1.4312 1.2682 1.0562 1.2023 1.0428 1.1889 1.0674 1.2976 1.1741 1.1292 1.3513 1.2776 1.2751 1.3959 1.5435 1.6761 1.6410 1.6211 1.6287 1.2386 1.2167 1.8908 1.0580 1.0627 1.0700 1.0743 1.0748 1.0689 1.0744 1.0650 1.0845 1.0851 1.0454 1.0848 1.0909 1.0916 1.0969 9.5025 8.6303 12.2634 1.0586 1.0586 1.0590 1.0592 1.0593 1.0595 1.0594 1.0592 1.0588 1.0619 1.0366 1.0633 1.0961 1.0968 1.0979 1.0831 1.0996 1.1017 1.0377 1.1026 1.0917 1.1013 1.0998 1.1007 1.1039 1.1021 1.1007 1.0993 1.0953 1.1019 1.0992 1.0660
irintensity: 0.0410 0.7979 0.5746 0.6273 0.1817 0.4586 0.8955 0.6317 0.9136 0.6195 2.1076 0.1135 0.2703 0.0835 0.2207 0.0022 0.9482 0.0830 0.2410 0.3689 0.3255 1.0369 8.7659 2.2719 0.1157 2.8864 1.2152 3.9939 43.5627 30.5279 64.3703 34.9887 2.2764 12.8207 13.5558 3.9496 0.1822 1.3555 9.3892 2.9934 4.8212 1.5639 9.3797 29.7379 23.5574 18.0343 1.1395 5.9853 2.1307 1.4847 4.6627 33.0453 50.0490 6.3817 21.0010 1.7986 4.8415 82.3958 74.4423 13.1333 5.1461 5.6607 15.7444 7.5250 52.5871 2.3865 141.9763 13.0916 1.2291 13.6221 9.6471 15.5697 1.1981 11.6292 3.3597 0.3814 9.7201 67.3798 11.8568 0.7025 11.1807 32.9786 9.1454 221.0518 91.5009 4.4577 2.1604 1.5647 0.8781 1.5205 5.2757 4.3602 1.8368 2.3288 0.6075 1.5969 0.3237 3.2492 0.5939 1.0845 2.1133 1.2163 2.9605 5.7482 0.3204 0.9756 1.5630 0.6605 7.9950 54.2782 11.2102 5.7487 23.8756 15.6959 5.0658 0.0334 0.0407 0.0383 0.0579 0.2864 0.5535 1.0324 11.7088 1.9884 1.4179 0.7955 43.4971 143.5239 7.4356 424.0962 0.0043 0.1437 0.2970 0.4557 0.8531 3.7380 1.1289 72.6064 121.9716 120.6064 37.0358 54.5588 0.0914 0.6076 1.3727 43.7558 1.7193 1.5289 1.3583 0.8791 2.0185 10.4625 1.5796 15.3333 222.5363 107.6046 97.0322 55.2073 7.0440 8.3422 2.3840 20.6271
temp: 298.150 k
press: 1.00000 atm
elementType: 8 8 8 8 8 6 6 6 6 6 6 6 6 6 6 6 6 6 6 6 6 6 6 6 1 1 1 1 1 1 1 1 1 1 1 1 1 1 1 1 1 1 1 1 1 1 1 1 1 1 1 1 1 1 1 1
symmnumber: 1
zpe: 1255330.0 jmol-1
zpe.correction: 0.478130 hartree
zpe.thermalcorrener: 0.506400 hartree
zpe.thermalcorrenthalpy: 0.507344 hartree
zpe.thermalcorrgfe: 0.413893 hartree
zpe.sumelectzpe: -1117.419563 hartree
zpe.sumelectthermal: -1117.391293 hartree
zpe.sumelectthermalent: -1117.390349 hartree
zpe.sumelectthermalfe: -1117.483801 hartree
dipole: 5.8765 0.2136 1.9131
dipole: 6.1837
quadrupole: -215.0397 -145.0833 -142.9239
quadrupole: -10.2941 -13.8997 1.8357
quadrupole: -47.3574 22.5990 24.7584 -10.2941 -13.8997 1.8357
hfenergy: -1117.8976933 hartree
pointgroup: C01 [X(C19H32O5)]
dipole: -2.317914 -0.1862169 0.7151738 debye
polarizability: 294.3066133|9.3711118|198.5834118|-16.7718414|4.6290227|183.7581286 unknown
InChI: InChI=1S/C19H32O5/c1-3-4-5-6-7-8-9-10-11-12-13-17(23-15(2)20)16-14-18(21)24-19(16)22/h14,17,19,22H,3-13H2,1-2H3
charge 0 multiplicity 1
56 atoms
O  3.382053 -1.530683 0.326468
O  6.211077 1.97638 0.906575
O  4.676552 0.694423 2.261275
O  7.967202 1.653779 -0.618309
O  4.649304 -2.480844 -1.390842
C  -1.791892 -0.230378 -0.304519
C  -0.488192 0.524039 0.040057
C  -3.068829 0.547652 0.085557
C  0.78505 -0.244532 -0.378655
C  -4.373051 -0.216199 -0.236196
C  2.079811 0.501924 0.006509
C  -5.650665 0.570356 0.134441
C  3.354233 -0.229358 -0.437418
C  -6.954878 -0.19919 -0.173689
C  -8.233069 0.59237 0.184582
C  4.633659 0.525526 -0.157905
C  -9.53726 -0.180328 -0.115827
C  4.825354 1.443639 1.044418
C  -10.815716 0.614254 0.23661
C  5.776925 0.514834 -0.892255
C  6.807925 1.392363 -0.268069
C  -12.113491 -0.167279 -0.062334
C  4.099625 -2.579594 -0.270176
C  4.116661 -3.787074 0.638299
H  -1.790824 -1.214677 0.208406
H  -1.813958 -0.44721 -1.39309
H  -0.499069 1.518591 -0.453531
H  -0.457348 0.718277 1.132626
H  -3.039845 0.780104 1.170863
H  -3.07743 1.524876 -0.441207
H  0.765427 -0.414571 -1.475523
H  0.789745 -1.243471 0.097864
H  -4.396202 -0.462182 -1.318647
H  -4.371222 -1.186849 0.30258
H  2.079937 1.50736 -0.463484
H  2.117114 0.650918 1.102805
H  -5.657457 1.536264 -0.412887
H  -5.623456 0.826047 1.214603
H  3.318666 -0.486963 -1.512635
H  -6.978321 -0.463214 -1.251919
H  -6.952303 -1.160918 0.380973
H  -8.238567 1.551335 -0.374965
H  -8.207448 0.861868 1.261485
H  -9.535574 -1.137143 0.447418
H  -9.562732 -0.454045 -1.191649
H  4.16952 2.337838 1.026124
H  -10.788024 0.89023 1.310738
H  -10.818422 1.568516 -0.328958
H  5.970258 -0.058324 -1.798339
H  -12.180528 -0.42802 -1.135615
H  -13.012016 0.421658 0.199035
H  -12.148586 -1.111291 0.513798
H  4.860196 1.288195 3.034532
H  3.132215 -3.938305 1.109514
H  4.41194 -4.678487 0.065958
H  4.850025 -3.620986 1.448231
