program: Gaussian 09
title: 000149047
version: EM64L-G09RevD.01
frameworkgroup: C1[X(C15H13NO2)]
method: RPBEPBE
basis: SDD
operation: Freq
keyword: #p
keyword: freq=noraman
keyword: PBEPBE/SDD
title: #p freq=noraman PBEPBE/SDD
converged: YES YES NO NO
title: Mulliken charges:
elementType: O O N C C C C C C C C C C C C C C C H H H H H H H H H H H H H
charge: -0.227175 -0.261212 -0.322154 -0.695970 0.317280 0.181065 0.276635 0.184619 -0.554977 -0.382784 -0.421991 -0.397416 0.427221 -0.434579 -0.239343 -0.233828 0.292866 -0.740795 0.246058 0.243952 0.270082 0.240472 0.239885 0.236755 0.228530 0.224509 0.224410 0.312588 0.256060 0.254988 0.254248
chargesum: 0.00000
title: Mulliken charges with hydrogens summed into heavy atoms:
elementType: O O N C C C C C C C C C C C C C C C
charge: -0.227175 -0.261212 -0.009567 -0.205959 0.317280 0.181065 0.276635 0.184619 -0.284895 -0.142312 -0.182106 -0.160660 0.427221 -0.206049 -0.014834 -0.009418 0.292866 0.024501
polarizability: 3.32093206e+02 -4.68549116e+00 1.75726806e+02 8.15697453e+00 6.38699451e+00 8.51641841e+01
1716.lowfreq: -7.8779 -3.3876 -0.0007 -0.0004 -0.0003 4.4252 24.3455 30.1052 59.2100
frequency: 24.3155 30.0503 59.2075 62.4627 85.0419 132.4150 173.0511 185.3036 210.5802 236.5218 265.8373 317.6298 344.4434 405.7502 418.2988 433.7887 444.9679 502.7449 510.9679 537.9843 556.7871 565.5944 594.9513 615.5407 643.6211 682.7465 704.6007 728.2261 738.5239 763.4964 774.3376 819.7271 821.5723 856.3534 866.2808 880.9563 933.2442 939.9752 944.6686 962.8877 967.1648 983.6830 992.6349 999.9983 1025.1064 1041.5196 1097.1583 1128.1816 1131.4641 1149.9783 1168.4120 1179.4503 1186.8967 1201.1182 1225.8972 1267.4488 1293.6085 1308.3849 1368.1343 1387.2543 1389.4542 1419.6159 1429.8410 1443.9169 1454.5514 1456.2141 1457.0340 1465.6099 1493.8029 1584.8918 1590.4402 1620.7486 1628.0736 1654.0439 2982.6434 3009.1833 3027.1327 3099.4566 3120.0017 3123.7558 3127.0228 3138.0636 3140.9731 3147.9079 3160.3762 3163.7988 3326.2272
redmass: 4.3660 5.1835 1.7025 2.6753 3.0581 3.7297 4.8178 5.0540 8.3010 2.1464 4.3691 4.0727 4.3477 5.6991 2.9209 2.8680 4.1435 3.3830 3.8877 5.6070 3.8134 4.9917 3.3511 5.9799 6.1285 2.3761 3.1203 4.6036 1.6684 4.3021 1.9803 1.9744 2.9812 4.6985 1.4166 1.4588 1.5972 3.1996 1.4379 2.1683 1.8939 1.3335 3.6702 2.7513 2.1195 1.5719 2.0621 1.8857 1.1506 1.4935 1.1377 3.4837 1.7168 1.8622 1.8399 1.9930 1.5579 2.2011 3.4830 2.6104 1.5191 1.4103 1.2409 2.7240 1.0674 1.0767 3.2367 2.8938 3.8461 7.2912 6.5781 7.2725 7.4071 8.1256 1.0607 1.0365 1.0994 1.0973 1.0854 1.0873 1.0894 1.1011 1.0945 1.0966 1.1002 1.0925 1.0760
irintensity: 1.1309 1.9443 0.1718 3.3559 1.0246 1.4725 0.6717 4.9967 4.3010 11.1772 27.6777 2.9322 11.7646 5.9297 10.2884 0.6182 24.4857 0.9935 3.7765 14.7008 15.6086 21.3858 32.3940 2.6713 6.2315 121.5934 1.6382 13.1454 50.6356 6.9911 65.0045 21.5280 11.0851 142.2598 4.6808 14.0996 0.9936 24.6791 1.1712 60.5917 14.2684 0.2571 13.4040 9.3204 5.0500 28.9182 4.2584 3.5955 0.0526 6.9819 0.0161 379.9291 3.1122 6.6909 15.3943 21.7629 2.3005 8.6397 10.2897 4.6610 42.5376 28.8035 33.9829 15.9228 14.6253 17.1034 84.0291 13.4432 25.3978 11.5435 0.5059 11.9283 126.0748 242.2970 13.9894 3.8921 7.9683 4.9075 6.4151 12.4555 2.3287 6.8757 27.4642 20.5688 44.0950 2.8381 50.1685
temp: 298.150 k
press: 1.00000 atm
elementType: 8 8 7 6 6 6 6 6 6 6 6 6 6 6 6 6 6 6 1 1 1 1 1 1 1 1 1 1 1 1 1
symmnumber: 1
zpe: 631231.9 jmol-1
zpe.correction: 0.240424 hartree
zpe.thermalcorrener: 0.255786 hartree
zpe.thermalcorrenthalpy: 0.256730 hartree
zpe.thermalcorrgfe: 0.195916 hartree
zpe.sumelectzpe: -783.316222 hartree
zpe.sumelectthermal: -783.300860 hartree
zpe.sumelectthermalent: -783.299916 hartree
zpe.sumelectthermalfe: -783.360730 hartree
dipole: -0.2631 -2.0813 0.7953
dipole: 2.2436
quadrupole: -95.1690 -91.0554 -110.7381
quadrupole: 11.0023 -1.2344 -0.0161
quadrupole: 3.8185 7.9321 -11.7506 11.0023 -1.2344 -0.0161
hfenergy: -783.5566458 hartree
pointgroup: C01 [X(C15H13N1O2)]
dipole: 0.1027711 -0.8251003 -0.296299 debye
polarizability: 332.0101352|4.3991168|175.415441|9.6058195|-8.138837|85.55862 unknown
InChI: InChI=1S/C15H13NO2/c1-10(17)18-16-13-6-7-15-12(9-13)8-11-4-2-3-5-14(11)15/h2-7,9,16H,8H2,1H3
charge 0 multiplicity 1
31 atoms
O  3.768282 -0.586927 0.378706
O  5.375595 0.857895 -0.496342
N  3.056242 0.653034 0.802681
C  -1.451967 -1.72709 0.381357
C  -0.450131 -0.577474 0.362354
C  -1.127479 0.652032 0.093266
C  -2.77854 -1.029636 0.095849
C  -2.565082 0.374191 -0.071927
C  0.935413 -0.6148 0.571675
C  -0.394428 1.857395 0.021824
C  -4.069863 -1.573675 -0.008386
C  -3.652098 1.234847 -0.345579
C  1.666948 0.601642 0.49264
C  1.002785 1.829089 0.208513
C  -5.160349 -0.7092 -0.28369
C  -4.950123 0.682555 -0.450295
C  4.996505 -0.313768 -0.265948
C  5.7246 -1.598196 -0.570025
H  -1.46135 -2.249085 1.35837
H  -1.214002 -2.492261 -0.383533
H  1.460349 -1.549138 0.788901
H  -0.892321 2.809639 -0.191249
H  -4.238863 -2.649293 0.119931
H  -3.499151 2.312403 -0.474915
H  1.583467 2.756958 0.139206
H  -6.173217 -1.118702 -0.368226
H  -5.803852 1.336371 -0.661944
H  3.589291 1.450953 0.404741
H  6.66335 -1.632633 0.010606
H  5.110996 -2.476222 -0.32137
H  5.993894 -1.619003 -1.63949
