program: Gaussian 09
title: 000149033
version: EM64L-G09RevD.01
frameworkgroup: C1[X(C11H15N3O2)]
method: RPBEPBE
basis: SDD
operation: Freq
keyword: #p
keyword: freq=noraman
keyword: PBEPBE/SDD
title: #p freq=noraman PBEPBE/SDD
converged: YES YES NO NO
title: Mulliken charges:
elementType: O O N N N C C C C C C C C C C C H H H H H H H H H H H H H H H
charge: -0.300403 -0.286310 -0.035142 -0.344350 0.065105 -0.567172 -0.416968 0.482774 -0.371189 -0.362959 0.327569 -0.495408 -0.225864 -0.241658 -0.242336 -0.662730 0.244602 0.228484 0.256946 0.276428 0.327361 0.249935 0.265275 0.238296 0.210420 0.228109 0.232468 0.231189 0.229494 0.213799 0.244235
chargesum: 0.00000
title: Mulliken charges with hydrogens summed into heavy atoms:
elementType: O O N N N C C C C C C C C C C C
charge: -0.300403 -0.286310 -0.035142 -0.016989 0.065105 -0.094086 0.116406 0.482774 -0.121254 -0.097684 0.327569 -0.046692 0.002246 -0.009191 -0.011147 0.024798
polarizability: 1.38393053e+02 1.84051824e+01 1.58612212e+02 -6.96173453e+00 1.34358664e+01 1.23512565e+02
1716.lowfreq: -11.4231 -5.7361 -0.0004 0.0006 0.0008 9.2863 17.5940 31.4127 40.9635
frequency: 16.3685 31.3344 40.9040 49.2645 63.2945 77.5006 92.0884 169.5255 185.8256 221.1994 235.4091 269.0565 302.8872 325.1989 364.6892 390.8837 399.1893 403.0251 468.9132 507.6039 571.7164 597.7616 616.5006 651.4146 665.4761 683.3412 704.1162 764.7990 796.1535 810.3958 831.8751 840.1485 853.0082 905.8623 929.2652 975.7850 977.4594 990.5817 998.3424 1000.5074 1027.0450 1050.4940 1063.0857 1080.2076 1096.5083 1110.9362 1166.7822 1173.3809 1192.0881 1201.5912 1207.8879 1257.3788 1269.5795 1318.6774 1327.5526 1338.4886 1342.9656 1345.8175 1383.1987 1388.7960 1392.9598 1425.5337 1443.7398 1450.6114 1455.3020 1471.1480 1475.9593 1484.8058 1488.7835 1595.2441 1611.8264 1613.1010 2985.4442 2994.1972 3024.6779 3034.3475 3040.3026 3088.2564 3091.1488 3103.8562 3114.1101 3122.4393 3129.3790 3140.8320 3151.4401 3165.3869 3555.2764
redmass: 4.4270 3.2820 3.2045 4.2179 6.5822 8.3785 3.2344 4.8399 2.2809 1.6507 3.8965 4.1890 6.0383 3.8768 3.8122 2.2074 2.5740 2.8099 3.8253 3.2263 4.5750 3.9269 6.2154 2.0222 1.6926 3.6025 1.6527 2.2133 1.3464 3.6424 2.9403 4.5560 1.2637 2.2115 1.5114 2.5185 1.4236 4.9792 1.4482 2.9362 2.2493 1.8665 2.1787 1.8622 1.8841 2.2698 2.7039 1.0560 1.1660 1.7874 2.7491 1.3491 1.7400 1.7602 1.5174 1.5727 1.8478 1.2927 2.8574 1.5878 1.2135 1.1250 2.1438 1.0962 1.1394 1.1112 1.6158 2.1584 1.0664 6.0274 6.1309 6.1188 1.0589 1.0361 1.0588 1.0601 1.1007 1.1050 1.1009 1.1006 1.1032 1.0857 1.0877 1.0921 1.0964 1.1015 1.0781
irintensity: 0.8134 1.4406 0.9930 3.6570 4.4332 13.7824 4.2275 0.2534 1.4462 1.8875 3.3222 5.2490 2.2056 4.3399 2.7618 6.7852 3.8246 1.0754 9.2051 10.0373 5.7539 12.6919 1.0433 112.0420 36.0139 2.2880 82.2243 27.3951 5.8415 1.4653 10.3769 39.2836 2.1455 35.5369 5.9848 47.3981 0.3715 0.5791 4.5557 37.9896 2.6843 19.6864 67.3940 4.5027 11.9285 2.9200 44.5570 0.5784 2.6284 83.1761 7.2465 23.0929 46.1014 64.2047 5.5840 15.1492 22.0614 13.2650 1.5438 1.3699 17.1660 48.4050 7.1583 16.6177 19.1835 54.7743 138.8133 6.8277 34.0732 1.8386 64.0275 59.2679 22.9978 23.1925 22.4814 21.7383 14.4050 5.7200 41.9887 21.2625 3.7530 1.4580 1.4890 15.9086 24.7727 17.1560 28.2630
temp: 298.150 k
press: 1.00000 atm
elementType: 8 8 7 7 7 6 6 6 6 6 6 6 6 6 6 6 1 1 1 1 1 1 1 1 1 1 1 1 1 1 1
symmnumber: 1
zpe: 656577.8 jmol-1
zpe.correction: 0.250077 hartree
zpe.thermalcorrener: 0.266090 hartree
zpe.thermalcorrenthalpy: 0.267034 hartree
zpe.thermalcorrgfe: 0.203690 hartree
zpe.sumelectzpe: -741.623467 hartree
zpe.sumelectthermal: -741.607454 hartree
zpe.sumelectthermalent: -741.606510 hartree
zpe.sumelectthermalfe: -741.669854 hartree
dipole: 0.4850 1.5723 0.0086
dipole: 1.6454
quadrupole: -90.1934 -99.0706 -95.5431
quadrupole: -3.2228 -3.0721 -12.7774
quadrupole: 4.7423 -4.1349 -0.6074 -3.2228 -3.0721 -12.7774
hfenergy: -741.873544 hartree
pointgroup: C01 [X(C11H15N3O2)]
dipole: 0.1732944 -0.6231447 -0.0271296 debye
polarizability: 132.4292155|-3.0450318|169.3477117|11.3978284|-7.3277078|118.7409026 unknown
InChI: InChI=1S/C11H15N3O2/c1-2-11(15)12-9-14(13-16)8-10-6-4-3-5-7-10/h3-7,12H,2,8-9H2,1H3
charge 0 multiplicity 1
31 atoms
O  2.515053 -0.733631 1.04898
O  0.198651 3.264642 -1.328612
N  0.036623 2.01157 0.522644
N  2.00533 0.921109 -0.500386
N  -0.59823 2.781083 -0.431138
C  -0.861525 1.293289 1.466318
C  1.514503 1.858091 0.504824
C  -1.306456 -0.079705 0.966336
C  -2.374469 -0.175453 0.037431
C  -0.669223 -1.262256 1.415257
C  2.480616 -0.340448 -0.157908
C  2.97988 -1.195348 -1.325573
C  -2.803684 -1.436512 -0.430601
C  -1.097898 -2.52514 0.94556
C  -2.16698 -2.615823 0.025064
C  2.541023 -2.669489 -1.182939
H  -1.737802 1.950762 1.604041
H  -0.331563 1.208546 2.430333
H  1.830726 1.484284 1.490969
H  1.931177 2.860537 0.306435
H  1.958121 1.215616 -1.477632
H  -2.863402 0.739129 -0.319668
H  0.178664 -1.197633 2.106468
H  4.086779 -1.141736 -1.323238
H  2.638797 -0.776509 -2.291416
H  -3.632738 -1.501141 -1.144192
H  -0.596097 -3.433056 1.29798
H  -2.502384 -3.595256 -0.334476
H  1.443105 -2.766222 -1.253583
H  2.998281 -3.289292 -1.974213
H  2.853921 -3.059711 -0.199863
