program: Gaussian 09
title: 000149052
version: EM64L-G09RevD.01
frameworkgroup: C1[X(C24H17ClO9)]
method: RPBEPBE
basis: SDD
operation: Freq
keyword: #p
keyword: freq=noraman
keyword: PBEPBE/SDD
title: #p freq=noraman PBEPBE/SDD
converged: YES YES NO NO
title: Mulliken charges:
elementType: Cl O O O O O O O O O C C C C C C C C C C C C C C C C C C C C C C C C H H H H H H H H H H H H H H H H H
charge: -0.043614 -0.159140 -0.220876 -0.441148 -0.296596 -0.280086 -0.266981 -0.166643 -0.140395 -0.230316 -0.326855 -0.100189 -0.159824 0.070580 -0.045254 0.279867 0.083389 0.141209 0.274131 -0.552704 0.184880 -0.485197 -0.086219 -0.526197 0.076486 -0.002923 0.257580 0.220286 -0.531479 -0.313872 -0.313430 -0.088300 -0.207871 -0.214143 0.306739 0.264650 0.272924 0.310235 0.275226 0.364957 0.258238 0.261165 0.256154 0.255096 0.233633 0.252003 0.236727 0.296534 0.269655 0.235861 0.262050
chargesum: 0.00000
title: Mulliken charges with hydrogens summed into heavy atoms:
elementType: Cl O O O O O O O O O C C C C C C C C C C C C C C C C C C C C C C C C
charge: -0.043614 -0.159140 -0.220876 -0.076191 -0.296596 -0.280086 -0.266981 -0.166643 -0.140395 -0.230316 -0.020116 0.164461 0.113100 0.070580 0.264981 0.279867 0.083389 0.141209 0.274131 -0.277477 0.184880 0.034206 -0.086219 -0.014947 0.076486 -0.002923 0.257580 0.220286 0.190884 -0.017338 -0.043775 -0.088300 0.027989 0.047907
polarizability: 3.52018642e+02 2.60934482e+01 3.41329884e+02 5.44893441e+01 -1.53289678e+01 2.47626260e+02
1716.lowfreq: -6.7903 -2.4374 -0.0013 -0.0011 -0.0010 1.6373 8.7075 12.8594 20.4941
frequency: 8.6468 12.7963 20.4500 34.7039 38.7640 53.0737 61.4881 69.4849 78.8554 93.4078 110.2844 122.0549 137.9242 151.9840 157.8227 171.4606 185.1213 191.2517 202.6077 212.2301 223.0085 237.4107 248.9460 264.8847 283.7621 289.0786 295.8629 324.7926 327.6329 338.4700 365.1606 388.9886 393.3957 399.4151 425.6877 436.3182 454.0045 464.5608 492.6513 497.6395 519.6658 528.2012 533.8874 550.1029 570.1079 602.5210 608.7623 627.6503 643.8130 661.6113 667.6715 670.5538 680.5392 696.5553 719.0432 720.7542 723.1856 737.6441 756.4753 770.5389 794.2045 806.4259 813.0472 824.4758 829.7931 837.5369 853.4132 872.6635 893.0581 912.2779 920.1469 923.8292 937.0129 937.9202 966.8591 983.4086 991.0710 992.0330 1001.9146 1006.4294 1021.7966 1039.4952 1044.3179 1047.8032 1064.5121 1073.2633 1091.1750 1094.6586 1111.3943 1130.9351 1139.3248 1158.6867 1171.7572 1176.6757 1191.8245 1194.7760 1198.7268 1215.6334 1229.8395 1244.4640 1251.1731 1266.5314 1273.9576 1282.8213 1286.0832 1292.4922 1300.3859 1313.9424 1334.5497 1352.3138 1385.2850 1389.6979 1397.1501 1416.7160 1427.5022 1438.9462 1444.5093 1458.6423 1465.4686 1468.3038 1476.9171 1482.4323 1542.2287 1574.3016 1595.4053 1602.7714 1623.3248 1630.9505 1641.3759 1735.0607 2975.7990 3014.8218 3025.5366 3053.2586 3053.9985 3059.9454 3071.6205 3081.6397 3127.1942 3132.8493 3136.9739 3145.1028 3171.9429 3173.1000 3186.9251 3198.2089 3577.4481
redmass: 9.2532 7.7514 5.4822 7.6824 7.8349 5.5510 7.9324 8.1737 6.4422 3.4372 5.8607 6.2644 2.6202 5.8076 5.3698 6.8243 4.1055 4.6596 3.1594 6.1417 6.1315 7.0391 2.6447 2.4858 4.0628 1.6837 4.3546 5.5558 5.4236 6.6825 6.3281 7.1103 8.7848 7.2237 3.4280 8.1266 6.6541 7.8535 7.6983 5.6484 7.6755 4.6848 5.9169 2.6776 7.2951 7.2944 3.9850 7.4402 7.4269 8.1729 7.4746 3.5824 8.0378 8.8641 4.2616 3.0730 5.9608 7.1182 5.1964 4.1795 6.7788 1.5649 7.2325 5.3340 1.9638 2.2468 4.3867 5.4102 4.3060 6.5416 4.8074 1.3718 1.5421 2.5458 4.7496 6.2603 2.1952 1.3572 4.2327 3.7869 5.1314 5.0075 5.7134 2.8279 4.1105 1.9442 1.5532 8.0675 1.2576 2.6777 1.2123 1.4610 1.3970 1.1087 1.3709 1.5019 1.1153 1.9348 1.8105 1.6614 1.6570 1.7894 3.6844 2.0983 1.4430 1.4780 2.2632 1.4447 1.2540 3.9030 10.5161 6.4576 1.6087 2.8894 1.2040 1.2931 1.1931 2.4033 1.5569 1.0506 2.8478 2.3595 7.8135 6.9057 10.5051 6.7210 10.1439 12.3303 12.2033 12.8262 1.0321 1.0601 1.0635 1.0859 1.0875 1.1008 1.1048 1.1009 1.0880 1.0923 1.1011 1.0883 1.0932 1.0941 1.0966 1.0920 1.0667
irintensity: 0.4667 1.8551 0.7251 0.4538 3.1101 0.0782 2.5336 0.2225 2.1918 2.9224 0.5837 2.1866 2.8016 0.1925 0.4924 1.3218 1.5290 0.3480 0.1597 1.6019 0.1345 0.6255 3.8731 12.9598 1.8009 86.7768 48.6471 2.4724 5.6016 5.0408 6.6391 6.2791 2.8200 16.9498 1.4174 14.3104 7.7618 1.9128 6.3532 8.4379 22.1639 2.1934 10.6720 9.1624 38.5067 2.8136 4.5232 36.9887 7.6382 22.9615 18.7387 5.0387 8.5710 18.7462 3.2313 32.2625 17.4772 97.3546 122.8023 82.9205 28.2543 23.3236 36.6506 62.0725 14.2645 23.4787 237.0442 16.1612 13.4902 296.8886 65.6728 10.2999 22.9134 101.8976 29.4934 5.5594 0.2316 0.4489 145.1375 38.0409 58.6761 23.6888 136.1979 21.0832 87.2251 35.4403 1.0887 101.3864 0.0237 35.1087 0.3507 32.7854 60.8823 5.8743 27.0697 73.0895 0.1056 205.1281 117.1155 39.8432 31.6193 66.2056 24.4063 84.9041 44.2620 1.3922 43.5584 14.7928 1.9557 149.1029 1.9795 79.0817 5.0046 68.4949 13.5288 52.0105 24.1552 9.3306 67.3298 13.9787 165.5056 93.5329 169.7657 48.2120 306.8211 0.1202 588.0667 6.1093 181.5596 549.2264 53.0855 13.4080 3.0387 13.5312 4.3010 0.7517 32.9381 10.3074 4.6118 19.5668 12.7928 8.0523 0.6361 4.3842 3.1362 0.5162 24.3936
temp: 298.150 k
press: 1.00000 atm
elementType: 17 8 8 8 8 8 8 8 8 8 6 6 6 6 6 6 6 6 6 6 6 6 6 6 6 6 6 6 6 6 6 6 6 6 1 1 1 1 1 1 1 1 1 1 1 1 1 1 1 1 1
symmnumber: 1
zpe: 953014.3 jmol-1
zpe.correction: 0.362984 hartree
zpe.thermalcorrener: 0.392250 hartree
zpe.thermalcorrenthalpy: 0.393194 hartree
zpe.thermalcorrgfe: 0.299322 hartree
zpe.sumelectzpe: -2059.423526 hartree
zpe.sumelectthermal: -2059.394260 hartree
zpe.sumelectthermalent: -2059.393316 hartree
zpe.sumelectthermalfe: -2059.487189 hartree
dipole: -0.2790 -5.1398 7.6956
dipole: 9.2583
quadrupole: -253.4589 -184.4686 -205.7745
quadrupole: -7.0349 -30.1499 -11.7868
quadrupole: -38.8915 30.0987 8.7928 -7.0349 -30.1499 -11.7868
hfenergy: -2059.7865103 hartree
pointgroup: C01 [X(C24H17Cl1O9)]
dipole: 0.2837042 -1.5753178 -3.2719603 debye
polarizability: 364.0241589|-27.9289953|325.9631192|43.0974286|35.1904796|250.9875079 unknown
InChI: InChI=1S/C24H17ClO9/c1-30-13-8-14-17(20-16(13)11-5-6-12(26)15(11)22(29)32-20)18-19(27)24(34-23(18)31-14)33-21(28)9-3-2-4-10(25)7-9/h2-4,7-8,18-19,23-24,27H,5-6H2,1H3
charge 0 multiplicity 1
51 atoms
Cl -6.188533 -4.005624 0.860333
O  -2.395457 3.233531 -0.454408
O  -1.052095 2.225507 -2.225669
O  -0.760274 4.187652 1.948608
O  -2.237529 1.121974 0.691062
O  2.316262 1.491131 0.970639
O  1.825392 -1.743024 -2.652882
O  5.763138 -1.207954 2.254234
O  3.912476 1.302174 2.635653
O  -4.50632 1.172259 1.273658
C  0.014564 3.071483 -0.159309
C  -1.15019 3.321254 -1.178038
C  -0.70817 2.922332 1.222194
C  0.639191 1.799232 -0.677249
C  -2.159584 2.591198 0.83398
C  -0.028523 1.366113 -1.836307
C  1.698745 1.031229 -0.185786
C  2.117524 -0.175672 -0.853976
C  3.231131 -0.878752 -0.275272
C  0.313229 0.195456 -2.541495
C  1.39073 -0.566247 -2.041718
C  3.887366 -2.157247 -0.77818
C  3.865739 -0.417419 0.886302
C  5.033471 -2.446184 0.219698
C  3.471591 0.778809 1.607437
C  4.987137 -1.317752 1.272401
C  -3.505599 0.527025 0.89603
C  -3.46629 -0.939002 0.626185
C  1.139191 -2.179398 -3.878862
C  -4.664622 -1.67065 0.836126
C  -2.291312 -1.597364 0.180501
C  -4.659319 -3.053277 0.595544
C  -2.317304 -2.988832 -0.050047
C  -3.503366 -3.731465 0.156116
H  0.723849 3.91424 -0.115648
H  -1.164975 4.260393 -1.745493
H  -0.257707 2.118544 1.830094
H  -2.930978 2.956408 1.526252
H  -0.247404 -0.087534 -3.43308
H  0.112592 4.347093 2.387899
H  3.14396 -2.972004 -0.830063
H  4.240804 -2.019251 -1.815178
H  6.028487 -2.448438 -0.259759
H  4.923833 -3.419319 0.730368
H  0.070411 -2.385484 -3.682559
H  1.651767 -3.105232 -4.176001
H  1.237477 -1.420613 -4.677051
H  -5.561902 -1.146678 1.178451
H  -1.378635 -1.017897 0.02121
H  -1.412906 -3.506652 -0.386147
H  -3.529662 -4.811069 -0.018199
