program: Gaussian 09
title: 000148979
version: EM64L-G09RevD.01
frameworkgroup: C1[X(C16H18N3)]
method: RPBEPBE
basis: SDD
operation: Freq
keyword: #p
keyword: freq=noraman
keyword: PBEPBE/SDD
title: #p freq=noraman PBEPBE/SDD
converged: YES YES NO NO
title: Mulliken charges:
elementType: N N N C C C C C C C C C C C C C C C C H H H H H H H H H H H H H H H H H H
charge: -0.198721 -0.684276 -0.690935 0.272199 0.150021 0.270927 0.293693 0.340234 -0.428487 -0.565109 -0.610638 -0.354126 -0.354482 -0.806039 0.546113 0.552144 -0.469548 -0.647496 -0.451069 0.258073 0.272298 0.247532 0.224929 0.234246 0.236404 0.275486 0.265798 0.265832 0.247592 0.231698 0.250584 0.249637 0.246518 0.337778 0.328357 0.328027 0.334808
chargesum: 1.00000
title: Mulliken charges with hydrogens summed into heavy atoms:
elementType: N N N C C C C C C C C C C C C C C C C
charge: -0.198721 -0.018140 -0.028100 0.272199 0.150021 0.270927 0.293693 0.340234 0.101884 -0.317577 -0.385709 -0.119881 -0.118078 0.001077 0.546113 0.552144 -0.221956 0.084422 -0.204551
polarizability: 3.68007354e+02 -1.57685443e+01 2.29703363e+02 -1.86563614e+00 -6.44070648e+00 8.88206354e+01
1716.lowfreq: -7.4736 -3.0135 -0.0002 0.0005 0.0006 9.2390 46.7456 60.1330 90.2724
frequency: 46.6840 60.1127 90.2684 105.8307 114.1366 151.7516 166.3889 180.5472 200.3656 252.0984 259.2533 286.4515 315.2454 358.1685 362.2699 390.2553 409.0306 420.2385 426.0351 433.8670 451.6022 466.0696 475.7081 499.1995 505.5549 511.5532 520.7477 561.3074 581.2736 615.0508 630.6168 668.9597 686.3797 698.6974 721.3476 732.0803 765.2898 807.4484 828.9301 838.7116 845.0434 853.0714 858.2064 937.8931 957.4666 964.2898 978.8187 983.1849 993.0679 1033.0000 1040.9568 1057.5735 1069.7742 1082.6843 1092.4504 1130.9821 1154.1042 1182.5226 1214.3304 1251.4430 1270.4149 1286.2359 1322.3027 1341.2191 1345.9843 1358.0414 1378.9983 1393.8343 1399.8460 1409.3072 1412.2878 1444.6624 1454.1705 1468.6929 1478.1158 1481.5577 1488.1003 1495.6110 1513.1112 1540.9007 1549.6082 1559.6882 1573.4155 1641.9083 1647.1203 1657.8434 1659.3954 2994.3227 3002.4521 3061.6074 3094.2781 3097.6543 3103.6642 3122.0568 3132.5235 3138.7806 3145.2328 3167.4874 3172.2535 3182.8568 3185.6373 3551.9025 3554.9249 3687.3484 3690.1459
redmass: 3.2341 3.1512 2.5518 1.8193 2.9086 2.1935 4.0414 4.0616 1.0923 3.5146 4.2247 3.0016 5.4220 4.1253 3.4586 3.2440 1.1435 1.0580 3.7749 2.9260 2.6837 3.4924 2.4407 1.8511 1.7521 1.2885 6.2728 3.0753 3.3968 3.7870 4.2039 4.1023 5.6693 5.6058 2.9408 3.4350 2.1244 1.2423 1.4853 1.7816 2.1054 2.8551 2.5137 2.6295 2.2274 1.4105 1.3618 6.0757 2.0958 1.5725 1.5679 1.8562 1.7335 2.5945 2.3272 1.8918 1.7487 1.2239 2.1207 1.3498 1.3503 1.5907 1.9766 1.5459 2.2738 2.6539 2.8112 3.0036 1.3055 1.2788 2.7380 2.9946 1.6444 1.1054 4.7637 1.6469 1.5371 1.2103 2.4210 1.2762 3.4286 4.2579 6.9066 3.1103 2.8559 1.4691 1.4376 1.0479 1.0368 1.0658 1.0967 1.0879 1.1000 1.1018 1.0982 1.0898 1.0899 1.0903 1.0965 1.0918 1.0911 1.0460 1.0461 1.1040 1.1040
irintensity: 1.0962 1.5582 0.5582 0.2171 4.6681 0.7519 1.3337 3.8960 0.3255 2.2113 0.7968 1.4708 2.0326 3.4031 0.2139 0.0855 4.0527 0.5638 1.6355 11.4366 23.4882 9.5094 19.5724 135.5632 47.0795 367.5163 6.3695 0.8191 0.6946 4.5957 0.6246 0.5121 5.7159 4.2181 7.1549 0.9899 1.1026 7.7554 27.4252 1.7654 83.8036 30.4323 7.2394 8.2459 5.6414 0.1143 0.3204 6.4429 2.2091 5.5620 0.3124 10.0103 5.4513 4.9441 34.2271 3.3125 14.2279 11.1554 15.9647 24.0199 14.8446 89.6095 61.6451 35.7713 5.4103 34.9111 27.4674 19.2499 23.9772 32.1437 21.3339 60.0532 5.7228 15.3125 9.8233 13.0465 74.5703 86.5792 331.6617 18.2981 9.0423 14.9616 34.3783 19.7527 117.8667 876.3139 22.6419 3.0863 9.7117 10.8617 11.1607 4.8424 13.8834 10.3543 5.9808 7.5539 5.1686 10.9798 2.0649 15.1225 6.0677 303.2594 133.1711 34.2593 33.4027
temp: 298.150 k
press: 1.00000 atm
elementType: 7 7 7 6 6 6 6 6 6 6 6 6 6 6 6 6 6 6 6 1 1 1 1 1 1 1 1 1 1 1 1 1 1 1 1 1 1
symmnumber: 1
zpe: 813065.2 jmol-1
zpe.correction: 0.309680 hartree
zpe.thermalcorrener: 0.326745 hartree
zpe.thermalcorrenthalpy: 0.327689 hartree
zpe.thermalcorrgfe: 0.266206 hartree
zpe.sumelectzpe: -783.242962 hartree
zpe.sumelectthermal: -783.225897 hartree
zpe.sumelectthermalent: -783.224952 hartree
zpe.sumelectthermalfe: -783.286436 hartree
dipole: 0.4025 1.6106 -0.3603
dipole: 1.6988
quadrupole: -25.3435 -69.7490 -116.8053
quadrupole: -1.9161 -0.9895 -2.8688
quadrupole: 45.2891 0.8835 -46.1727 -1.9161 -0.9895 -2.8688
hfenergy: -783.5526419 hartree
pointgroup: C01 [X(C16H18N3)]
dipole: -0.1390349 0.6394063 0.1360976 debye
polarizability: 368.8990958|11.0021398|228.8712037|2.3898356|5.8634984|88.7610528 unknown
InChI: InChI=1S/C16H18N3/c1-3-19-10(2)15-8-11(17)4-6-13(15)14-7-5-12(18)9-16(14)19/h4-9H,3,17-18H2,1-2H3
charge 1 multiplicity 1
37 atoms
N  -0.678253 1.496051 0.196882
N  -4.792728 -1.185329 -0.000062
N  5.154433 -0.495945 0.032046
C  -1.342756 0.238015 0.093471
C  0.688281 1.622351 0.122612
C  -0.538621 -0.95086 -0.018896
C  1.524925 0.45164 0.051544
C  0.900471 -0.85259 -0.015761
C  -1.528248 2.721465 0.402285
C  -2.759539 0.160231 0.096695
C  2.950855 0.563595 0.066304
C  -1.231987 -2.200922 -0.118852
C  1.758604 -1.99687 -0.080625
C  1.299706 3.005761 0.135968
C  -3.414495 -1.091112 0.000187
C  3.774288 -0.579695 0.009556
C  -2.61686 -2.282604 -0.107942
C  -2.066504 3.312245 -0.915511
C  3.141969 -1.872909 -0.071872
H  -2.348263 2.438243 1.080101
H  -0.93136 3.464327 0.949637
H  -3.38016 1.055852 0.152462
H  3.427322 1.543775 0.147156
H  -0.66073 -3.127778 -0.207498
H  1.331541 -3.000965 -0.135264
H  1.537795 3.332213 1.167082
H  2.240375 3.008198 -0.433194
H  0.653999 3.767511 -0.322989
H  -3.110321 -3.257578 -0.18506
H  -1.248923 3.650366 -1.575589
H  -2.703179 4.18598 -0.691662
H  -2.670049 2.581333 -1.478667
H  3.76842 -2.771072 -0.122863
H  -5.253959 -2.088345 -0.081995
H  -5.384199 -0.3620 0.08458
H  5.630871 0.401025 0.0855
H  5.731079 -1.332999 -0.001668
