program: Gaussian 09
title: 000149101
version: EM64L-G09RevD.01
frameworkgroup: C1[X(C11H18N4O6)]
method: RPBEPBE
basis: SDD
operation: Freq
keyword: #p
keyword: freq=noraman
keyword: PBEPBE/SDD
title: #p freq=noraman PBEPBE/SDD
converged: YES YES NO NO
title: Mulliken charges:
elementType: O O O O O O N N N N C C C C C C C C C C C H H H H H H H H H H H H H H H H H H
charge: -0.316459 -0.466854 -0.460879 -0.423387 -0.330315 -0.460665 -0.214133 -0.104752 -0.383288 -0.257234 -0.200222 -0.119825 -0.038656 -0.078064 -0.363492 -0.078794 0.096318 -0.352086 0.246078 -0.390510 -0.295911 0.234323 0.259272 0.275581 0.261697 0.213491 0.221682 0.392150 0.375878 0.299368 0.343502 0.238927 0.321456 0.318643 0.231150 0.244126 0.211063 0.203001 0.347820
chargesum: 0.00000
title: Mulliken charges with hydrogens summed into heavy atoms:
elementType: O O O O O O N N N N C C C C C C C C C C C
charge: -0.316459 -0.074704 -0.085001 -0.079885 -0.330315 -0.112844 -0.214133 -0.104752 -0.061833 0.061409 0.034102 0.139447 0.236925 0.183633 0.071681 0.220573 0.096318 -0.113158 0.246078 0.084766 0.118153
polarizability: 2.58753545e+02 1.14157502e+01 1.62981582e+02 5.80459308e-01 -3.34875443e+00 1.14584716e+02
1716.lowfreq: -10.6075 -8.7822 -0.0006 -0.0005 0.0003 3.6218 11.6300 19.1437 35.0734
frequency: 7.4245 18.9044 35.0487 49.2481 70.3647 83.1852 89.5674 95.2649 120.8874 156.6328 185.3614 191.8063 197.8545 201.0200 246.1585 260.1286 262.8665 270.6860 285.4343 312.2567 330.7592 335.4938 376.0074 427.6499 444.3887 452.0558 470.6128 494.2282 528.3294 543.4489 562.4755 567.3962 574.0945 622.4848 658.1961 675.6513 700.1096 722.6692 743.2890 767.3179 772.2447 804.3360 808.9887 838.9998 851.3247 899.3484 918.2824 962.0958 964.2396 967.0754 971.0067 988.3412 994.2592 1014.5356 1017.5042 1036.4189 1056.6299 1064.1556 1064.7896 1106.0767 1115.9568 1133.8417 1156.0113 1173.1674 1195.2669 1207.0477 1211.0791 1233.3861 1245.4539 1250.1621 1263.7968 1275.3002 1283.1719 1303.1445 1304.6270 1317.5831 1324.5171 1325.8654 1342.7689 1347.5146 1367.1146 1387.3300 1404.8842 1412.3768 1423.0204 1451.6812 1470.4656 1473.1592 1478.2722 1496.8361 1539.5554 1587.1590 1633.6646 2959.4786 2979.5677 2982.1172 3008.2365 3015.5574 3019.5019 3023.3316 3032.8861 3078.5936 3090.7289 3135.5276 3176.2294 3202.6614 3384.4243 3410.5986 3558.6611 3562.5427 3577.3509
redmass: 6.1263 5.3746 6.3828 7.2788 4.8068 4.7821 2.7603 3.2660 4.2713 4.6040 4.7623 3.9641 5.2742 6.0399 4.0816 5.1634 3.1058 1.0915 6.4506 1.5372 3.2656 3.9299 4.6124 4.9758 4.0431 4.1526 3.1535 1.6495 4.2345 4.2202 1.2538 3.4012 8.1678 5.8689 6.0364 3.5651 2.0212 5.6518 8.0506 2.4855 1.9250 1.1142 1.2885 3.0872 5.1856 3.0240 2.5925 4.1220 4.0963 1.3921 4.4123 4.3801 3.1348 2.1704 4.0777 3.5281 2.0538 3.9602 2.8835 2.0979 4.7244 1.7160 1.3591 1.9104 1.3809 1.8247 1.3489 2.3339 1.2568 1.3434 1.4816 1.1800 1.2797 1.3695 1.2126 1.4069 1.2921 1.3004 1.2949 1.3234 1.2281 1.7003 1.5291 1.4022 1.6525 1.0845 2.0448 1.0883 1.6313 2.1261 1.4046 6.9705 6.9087 1.0553 1.0662 1.0834 1.0853 1.1065 1.0871 1.0608 1.0871 1.0991 1.1060 1.0667 1.0902 1.0984 1.0735 1.0640 1.0789 1.0663 1.0667
irintensity: 0.2450 2.7430 0.2938 4.0870 2.0060 10.6996 3.0035 3.4047 5.6032 7.6009 2.4581 17.1187 3.5092 0.3302 14.7502 28.8967 15.8192 153.3152 26.9165 109.7894 23.1257 26.5060 9.0449 8.9371 1.5677 58.2339 34.8675 94.2952 11.7185 61.8168 140.5433 80.4657 14.3874 18.5285 1.6408 32.4714 52.0023 13.9315 7.3018 16.3630 104.2150 106.4299 50.8716 25.9277 11.4330 24.1969 4.5041 175.3170 53.6595 28.5563 54.0582 79.2864 42.2205 14.4184 85.9611 87.8527 18.2358 74.1285 46.3730 27.9455 8.3203 2.4870 25.2235 21.6939 21.1396 21.3128 33.2424 28.0268 58.0675 94.6028 44.1660 25.7457 7.3225 6.4218 4.3146 21.9826 12.6159 8.5256 93.6976 25.5906 10.7732 23.8977 463.7029 11.8501 70.2918 12.8715 36.4846 6.0418 51.4327 97.2259 46.0163 129.2341 680.8604 55.4058 39.4272 23.4227 15.3401 36.0658 42.0264 44.3680 21.0302 37.9918 30.8019 650.2186 2.8178 8.4597 8.6332 46.7751 86.8424 11.5354 3.3256
temp: 298.150 k
press: 1.00000 atm
elementType: 8 8 8 8 8 8 7 7 7 7 6 6 6 6 6 6 6 6 6 6 6 1 1 1 1 1 1 1 1 1 1 1 1 1 1 1 1 1 1
symmnumber: 1
zpe: 804910.9 jmol-1
zpe.correction: 0.306574 hartree
zpe.thermalcorrener: 0.327754 hartree
zpe.thermalcorrenthalpy: 0.328698 hartree
zpe.thermalcorrgfe: 0.253529 hartree
zpe.sumelectzpe: -1098.625307 hartree
zpe.sumelectthermal: -1098.604128 hartree
zpe.sumelectthermalent: -1098.603184 hartree
zpe.sumelectthermalfe: -1098.678353 hartree
dipole: -0.9879 -5.5648 0.7096
dipole: 5.6961
quadrupole: -137.5851 -118.7283 -130.2525
quadrupole: -5.1353 -2.0460 5.2796
quadrupole: -8.7298 10.1270 -1.3972 -5.1353 -2.0460 5.2796
hfenergy: -1098.9318818 hartree
pointgroup: C01 [X(C11H18N4O6)]
dipole: 0.3059083 -2.2174894 -0.1067918 debye
polarizability: 257.7945082|-14.8489581|164.1787944|0.5204148|-0.474326|114.3465399 unknown
InChI: InChI=1S/C11H18N4O6/c16-4-2-12-14-7-1-3-15(11(20)13-7)10-9(19)8(18)6(5-17)21-10/h1,3,6,8-10,12,14,16-19H,2,4-5H2
charge 0 multiplicity 1
39 atoms
O  -2.594535 -0.923469 0.777345
O  -1.854007 2.523286 -0.168348
O  -4.268517 1.758609 0.505889
O  -5.13446 -1.382207 -1.975844
O  0.51921 1.8569 0.723944
O  5.679344 0.595296 -2.535656
N  -0.275907 -0.347258 0.659305
N  2.09375 0.128203 0.698857
N  3.647221 -1.603067 0.644689
N  4.717634 -0.687091 0.878279
C  -2.090439 1.118991 -0.418637
C  -3.625114 0.892056 -0.476798
C  -1.664731 0.199709 0.770792
C  -3.807877 -0.568731 -0.040585
C  -3.908706 -1.5831 -1.195332
C  -0.026591 -1.70537 0.616358
C  0.80985 0.611549 0.697398
C  1.267843 -2.188533 0.595967
C  2.328722 -1.210155 0.636009
C  5.502096 -0.356452 -0.346607
C  4.726101 0.420135 -1.427355
H  -1.598377 0.770324 -1.34985
H  -4.037264 1.069642 -1.487818
H  -1.730915 0.768448 1.719695
H  -4.682396 -0.642638 0.631793
H  -3.846469 -2.610991 -0.782551
H  -3.088441 -1.444693 -1.919726
H  -0.908191 2.575747 0.198043
H  -3.697615 2.579738 0.545645
H  -0.911582 -2.343646 0.608323
H  -5.923205 -1.540175 -1.397248
H  1.460729 -3.262422 0.559277
H  3.88744 -2.587996 0.763256
H  4.294578 0.158663 1.298378
H  5.894155 -1.292541 -0.782024
H  6.370304 0.239566 -0.014531
H  4.378714 1.393756 -1.024898
H  3.837514 -0.160058 -1.751574
H  5.268533 1.153475 -3.241861
