program: Gaussian 09
title: 000106607
version: EM64L-G09RevD.01
frameworkgroup: C1[X(C14H22O4)]
method: RPBEPBE
basis: SDD
operation: Freq
keyword: #pfreq=noraman
keyword: PBEPBE/SDD
title: #p freq=noraman PBEPBE/SDD
converged: YES YES NO NO
title: Mulliken charges:
elementType: O O O O C C C C C C C C C C C C C C H H H H H H H H H H H H H H H H H H H H H H
charge: -0.284582 -0.274691 -0.247062 -0.244187 0.037937 -0.433812 -0.445602 -0.400241 -0.396903 -0.387942 0.251352 -0.079684 -0.262595 -0.282719 -0.697421 -0.687949 -0.277302 0.258627 0.233127 0.204286 0.236865 0.215515 0.208775 0.200533 0.207317 0.207554 0.197809 0.191985 0.204344 0.216853 0.233252 0.221992 0.285919 0.208903 0.215995 0.223738 0.241820 0.200352 0.213656 0.284184
chargesum: 0.00000
title: Mulliken charges with hydrogens summed into heavy atoms:
elementType: O O O O C C C C C C C C C C C C C C
charge: -0.284582 -0.274691 -0.247062 -0.244187 0.271064 0.007339 -0.021312 0.007609 0.008460 0.008387 0.251352 0.137169 0.192649 0.003200 -0.048785 -0.032121 0.006882 0.258627
polarizability: 2.66991441e+02 2.76987082e+00 1.44570629e+02 3.01203216e+00 -2.58217289e+00 1.19711588e+02
1716.lowfreq: -24.7418 -4.8508 -0.0006 0.0007 0.0015 2.8775 17.3797 25.5769 33.8964
frequency: 8.2503 24.1944 33.6531 40.2448 46.4790 67.6909 78.3653 121.7682 130.4246 161.4245 180.5915 207.1193 209.2932 213.8356 236.2954 240.4145 254.0696 277.9712 315.9307 324.4519 347.2811 390.4314 410.4052 430.2606 443.0038 458.3801 507.7514 573.1600 611.4601 639.7727 723.6827 728.6433 783.7841 791.3916 826.1186 838.0554 866.7780 878.7898 891.9922 896.0235 909.7673 918.7330 922.0354 923.8958 950.1279 964.1808 967.6065 979.8729 998.2893 1011.4201 1044.4258 1052.2195 1081.9799 1108.6616 1129.4427 1133.5299 1137.5026 1149.5461 1150.5976 1191.4551 1198.2071 1228.7127 1239.8483 1253.2876 1258.5623 1272.8542 1285.0189 1296.1891 1301.3598 1307.9590 1329.8380 1335.3894 1338.5387 1340.0007 1346.6198 1360.0511 1362.5345 1378.1306 1397.8785 1460.9781 1461.3256 1462.6515 1464.1076 1469.9164 1471.0824 1474.2547 1479.1921 1483.7877 1490.2895 1605.1099 1611.6893 1659.8856 2971.2580 2972.1776 2972.7537 2973.9175 2976.2728 2988.3606 2988.4797 2990.3375 2995.8231 3009.8373 3035.9896 3038.0812 3046.3932 3057.9791 3059.2764 3063.9461 3066.6027 3073.0689 3079.1489 3091.8877 3159.5950 3163.5986
redmass: 3.7416 3.3848 4.0852 4.5269 4.2413 6.0527 4.1701 4.0809 3.2851 3.9375 3.8118 2.2973 1.1952 1.9734 1.8554 2.1195 2.1776 6.1756 2.9910 2.1900 4.0444 2.7889 2.0025 2.9252 2.9144 2.1851 2.5524 3.3415 4.3492 7.3360 9.8053 7.5200 1.6426 1.9412 2.8911 2.4015 3.4569 1.7710 1.7422 1.6022 2.2870 2.1213 1.7023 1.3252 2.2500 3.1113 1.9217 3.1165 2.7853 1.0868 1.8782 1.0794 1.3092 2.6942 2.0637 3.9127 2.2181 1.7391 2.3183 1.7384 1.4931 1.2785 1.3114 1.2801 1.3253 1.6796 1.4062 1.4149 1.3069 1.3198 1.3516 1.5192 1.4694 1.4477 1.5309 1.4970 1.5684 1.2108 1.2196 1.0723 1.0883 1.0858 1.0919 1.0450 1.0839 1.0602 1.0978 1.0479 1.0597 11.3733 10.8247 6.7067 1.0657 1.0359 1.0631 1.0617 1.0377 1.0616 1.0746 1.0650 1.0652 1.0821 1.0958 1.0980 1.1008 1.1021 1.1055 1.0997 1.1026 1.1005 1.0990 1.0993 1.0986 1.0867
irintensity: 0.5555 0.6093 0.6549 0.1416 0.0047 1.7784 0.1342 0.5616 0.8809 1.2743 1.6101 3.8104 1.3258 0.8446 3.4287 12.3671 6.1305 1.6897 0.6765 3.8164 11.8392 1.0089 4.9205 2.2372 2.8129 0.3486 1.0700 1.8940 0.0585 16.2710 12.8910 2.1262 1.7857 2.3544 0.9270 9.3937 13.1241 4.0827 1.4304 15.9323 1.8578 0.0548 0.4644 5.6200 55.9639 86.9190 34.6381 156.0711 102.9390 57.0831 1.6890 0.4988 7.6715 5.0478 564.0173 1.3181 6.4710 0.5685 1.0980 6.3991 0.8700 4.5123 0.6246 3.7256 45.7351 525.3734 0.2537 17.2295 65.0462 0.4592 0.4473 0.8992 0.5458 6.1527 0.5782 2.1919 7.1517 22.2520 14.3323 2.3496 4.6800 2.9187 16.3785 1.4034 20.1369 8.7139 3.1467 13.5007 23.5218 234.6304 46.6554 0.1025 34.7720 31.1116 31.2156 36.3775 26.5743 8.5945 5.8275 14.7539 26.2304 20.1611 66.6426 61.3383 40.9360 25.1820 2.5263 20.4132 62.9848 77.3849 54.2208 37.0100 0.0026 0.7504
temp: 298.150 k
press: 1.00000 atm
elementType: 8 8 8 8 6 6 6 6 6 6 6 6 6 6 6 6 6 6 1 1 1 1 1 1 1 1 1 1 1 1 1 1 1 1 1 1 1 1 1 1
symmnumber: 1
zpe: 886043.8 jmol-1
zpe.correction: 0.337476 hartree
zpe.thermalcorrener: 0.357385 hartree
zpe.thermalcorrenthalpy: 0.358330 hartree
zpe.thermalcorrgfe: 0.285270 hartree
zpe.sumelectzpe: -846.175012 hartree
zpe.sumelectthermal: -846.155102 hartree
zpe.sumelectthermalent: -846.154158 hartree
zpe.sumelectthermalfe: -846.227218 hartree
dipole: 0.4828 -0.2951 -0.2569
dipole: 0.6214
quadrupole: -76.1537 -117.8871 -107.3619
quadrupole: 4.3536 0.5875 2.3438
quadrupole: 24.3138 -17.4195 -6.8943 4.3536 0.5875 2.3438
hfenergy: -846.5124878 hartree
pointgroup: C01 [X(C14H22O4)]
dipole: -0.1865456 0.1260108 -0.0953397 debye
polarizability: 267.0941678|1.490519|143.9447536|0.3371094|4.6008569|120.2347367 unknown
InChI: InChI=1S/C14H22O4/c1-11(2)10-17-13(15)8-9-14(16)18-12-6-4-3-5-7-12/h8-9,11-12H,3-7,10H2,1-2H3
charge 0 multiplicity 1
40 atoms
O  -2.236928 -0.538403 -0.111253
O  3.70324 0.111475 -0.128271
O  -1.186975 1.489722 0.421537
O  2.653441 -1.929331 -0.577766
C  -3.591256 0.087205 0.085383
C  -4.015043 0.82066 -1.200581
C  -4.543067 -1.060968 0.445121
C  -5.463877 1.352132 -1.054914
C  -5.992947 -0.531187 0.585415
C  -6.447255 0.212514 -0.694017
C  -1.124244 0.279502 0.085359
C  6.110015 0.539387 -0.196815
C  5.030216 -0.540457 -0.341612
C  0.117201 -0.501542 -0.153969
C  7.485681 -0.071367 -0.558236
C  6.117525 1.149604 1.222958
C  1.345833 0.073667 -0.044718
C  2.584568 -0.709986 -0.281417
H  -3.503142 0.814172 0.916667
H  -3.961562 0.108908 -2.047937
H  -3.314907 1.649669 -1.407782
H  -4.20874 -1.546451 1.380426
H  -4.498683 -1.823338 -0.357099
H  -5.493758 2.127363 -0.261925
H  -5.771841 1.846791 -1.995332
H  -6.67439 -1.374569 0.80508
H  -6.052042 0.160494 1.450919
H  -6.496271 -0.50738 -1.536673
H  -7.467761 0.618466 -0.556787
H  5.877844 1.342348 -0.925031
H  5.031233 -1.001016 -1.347069
H  5.146361 -1.345425 0.409571
H  0.011744 -1.558145 -0.422211
H  7.748728 -0.894699 0.133484
H  7.499104 -0.472952 -1.588786
H  8.278422 0.69426 -0.48257
H  5.130269 1.571035 1.478927
H  6.371022 0.380534 1.978338
H  6.86906 1.956599 1.297215
H  1.450782 1.130908 0.22117
